r65135 ruby 2.3.8p459 (2018-10-18) [x86_64-linux] [2.3] (ubuntu) 1019W failed(test-all) 4failed(test/) rubyspec:118F314E

chkbuild summary recent last

OlderDiff < 20190419T230024Z(failure) < ThisDiff > 20190420T020129Z(failure)

===================================================================
+++ 20190420T020129Z
@@ 152 @@
 Gid:	1003	1003	1003	1003
 FDSize:	64
 Groups:	1003
+NStgid:	1901
+NSpid:	1901
+NSpgid:	1901
+NSsid:	22336
 VmPeak: <nnn> kB
 VmSize: <nnn> kB
 VmLck: <nnn> kB
 VmPin:	       0 kB
 VmHWM: <nnn> kB
 VmRSS: <nnn> kB
+RssAnon:	      64 kB
+RssFile:	     692 kB
 RssShmem:	       0 kB
 VmData: <nnn> kB
 VmStk: <nnn> kB
@@ 17982 @@
 
  <n>) Error:
 TestRDocRubygemsHook#test_generate_default_gem:
+RuntimeError: no  in [#<Digest::SHA512: e392516336363eaac9286be44d5b95a932619711d885842376e60dd5b233908c04ec669d76badef18637f4ccd217ba9f0de3556b03709882ec620336024bdb3d>]
     <build-dir>/ruby/lib/rubygems/package/tar_writer.rb:<line_a>:in `add_file_signed'
     <build-dir>/ruby/lib/rubygems/package.rb:<line_a>:in `add_metadata'
     <build-dir>/ruby/lib/rubygems/package.rb:<line_a>:in `block (2 levels) in build'
@@ 18002 @@
 
  <n>) Error:
 TestRDocRubygemsHook#test_delete_legacy_args:
+RuntimeError: no  in [#<Digest::SHA512: e392516336363eaac9286be44d5b95a932619711d885842376e60dd5b233908c04ec669d76badef18637f4ccd217ba9f0de3556b03709882ec620336024bdb3d>]
     <build-dir>/ruby/lib/rubygems/package/tar_writer.rb:<line_a>:in `add_file_signed'
     <build-dir>/ruby/lib/rubygems/package.rb:<line_a>:in `add_metadata'
     <build-dir>/ruby/lib/rubygems/package.rb:<line_a>:in `block (2 levels) in build'
@@ 18022 @@
 
  <n>) Error:
 TestRDocRubygemsHook#test_generate_configuration_rdoc_array:
+RuntimeError: no  in [#<Digest::SHA512: e392516336363eaac9286be44d5b95a932619711d885842376e60dd5b233908c04ec669d76badef18637f4ccd217ba9f0de3556b03709882ec620336024bdb3d>]
     <build-dir>/ruby/lib/rubygems/package/tar_writer.rb:<line_a>:in `add_file_signed'
     <build-dir>/ruby/lib/rubygems/package.rb:<line_a>:in `add_metadata'
     <build-dir>/ruby/lib/rubygems/package.rb:<line_a>:in `block (2 levels) in build'
@@ 18042 @@
 
  <n>) Error:
 TestRDocRubygemsHook#test_ri_installed?:
+RuntimeError: no  in [#<Digest::SHA512: e392516336363eaac9286be44d5b95a932619711d885842376e60dd5b233908c04ec669d76badef18637f4ccd217ba9f0de3556b03709882ec620336024bdb3d>]
     <build-dir>/ruby/lib/rubygems/package/tar_writer.rb:<line_a>:in `add_file_signed'
     <build-dir>/ruby/lib/rubygems/package.rb:<line_a>:in `add_metadata'
     <build-dir>/ruby/lib/rubygems/package.rb:<line_a>:in `block (2 levels) in build'
@@ 18062 @@
 
  <n>) Error:
 TestRDocRubygemsHook#test_generate:
+RuntimeError: no  in [#<Digest::SHA512: e392516336363eaac9286be44d5b95a932619711d885842376e60dd5b233908c04ec669d76badef18637f4ccd217ba9f0de3556b03709882ec620336024bdb3d>]
     <build-dir>/ruby/lib/rubygems/package/tar_writer.rb:<line_a>:in `add_file_signed'
     <build-dir>/ruby/lib/rubygems/package.rb:<line_a>:in `add_metadata'
     <build-dir>/ruby/lib/rubygems/package.rb:<line_a>:in `block (2 levels) in build'
@@ 18082 @@
 
  <n>) Error:
 TestRDocRubygemsHook#test_rdoc_installed?:
+RuntimeError: no  in [#<Digest::SHA512: e392516336363eaac9286be44d5b95a932619711d885842376e60dd5b233908c04ec669d76badef18637f4ccd217ba9f0de3556b03709882ec620336024bdb3d>]
     <build-dir>/ruby/lib/rubygems/package/tar_writer.rb:<line_a>:in `add_file_signed'
     <build-dir>/ruby/lib/rubygems/package.rb:<line_a>:in `add_metadata'
     <build-dir>/ruby/lib/rubygems/package.rb:<line_a>:in `block (2 levels) in build'
@@ 18102 @@
 
  <n>) Error:
 TestRDocRubygemsHook#test_remove_unwritable:
+RuntimeError: no  in [#<Digest::SHA512: e392516336363eaac9286be44d5b95a932619711d885842376e60dd5b233908c04ec669d76badef18637f4ccd217ba9f0de3556b03709882ec620336024bdb3d>]
     <build-dir>/ruby/lib/rubygems/package/tar_writer.rb:<line_a>:in `add_file_signed'
     <build-dir>/ruby/lib/rubygems/package.rb:<line_a>:in `add_metadata'
     <build-dir>/ruby/lib/rubygems/package.rb:<line_a>:in `block (2 levels) in build'
@@ 18122 @@
 
  <n>) Error:
 TestRDocRubygemsHook#test_generate_force:
+RuntimeError: no  in [#<Digest::SHA512: e392516336363eaac9286be44d5b95a932619711d885842376e60dd5b233908c04ec669d76badef18637f4ccd217ba9f0de3556b03709882ec620336024bdb3d>]
     <build-dir>/ruby/lib/rubygems/package/tar_writer.rb:<line_a>:in `add_file_signed'
     <build-dir>/ruby/lib/rubygems/package.rb:<line_a>:in `add_metadata'
     <build-dir>/ruby/lib/rubygems/package.rb:<line_a>:in `block (2 levels) in build'
@@ 18142 @@
 
  <n>) Error:
 TestRDocRubygemsHook#test_document:
+RuntimeError: no  in [#<Digest::SHA512: e392516336363eaac9286be44d5b95a932619711d885842376e60dd5b233908c04ec669d76badef18637f4ccd217ba9f0de3556b03709882ec620336024bdb3d>]
     <build-dir>/ruby/lib/rubygems/package/tar_writer.rb:<line_a>:in `add_file_signed'
     <build-dir>/ruby/lib/rubygems/package.rb:<line_a>:in `add_metadata'
     <build-dir>/ruby/lib/rubygems/package.rb:<line_a>:in `block (2 levels) in build'
@@ 18162 @@
 
  <n>) Error:
 TestRDocRubygemsHook#test_new_rdoc:
+RuntimeError: no  in [#<Digest::SHA512: e392516336363eaac9286be44d5b95a932619711d885842376e60dd5b233908c04ec669d76badef18637f4ccd217ba9f0de3556b03709882ec620336024bdb3d>]
     <build-dir>/ruby/lib/rubygems/package/tar_writer.rb:<line_a>:in `add_file_signed'
     <build-dir>/ruby/lib/rubygems/package.rb:<line_a>:in `add_metadata'
     <build-dir>/ruby/lib/rubygems/package.rb:<line_a>:in `block (2 levels) in build'
@@ 18182 @@
 
  <n>) Error:
 TestRDocRubygemsHook#test_setup_unwritable:
+RuntimeError: no  in [#<Digest::SHA512: e392516336363eaac9286be44d5b95a932619711d885842376e60dd5b233908c04ec669d76badef18637f4ccd217ba9f0de3556b03709882ec620336024bdb3d>]
     <build-dir>/ruby/lib/rubygems/package/tar_writer.rb:<line_a>:in `add_file_signed'
     <build-dir>/ruby/lib/rubygems/package.rb:<line_a>:in `add_metadata'
     <build-dir>/ruby/lib/rubygems/package.rb:<line_a>:in `block (2 levels) in build'
@@ 18202 @@
 
  <n>) Error:
 TestRDocRubygemsHook#test_generate_configuration_rdoc_string:
+RuntimeError: no  in [#<Digest::SHA512: e392516336363eaac9286be44d5b95a932619711d885842376e60dd5b233908c04ec669d76badef18637f4ccd217ba9f0de3556b03709882ec620336024bdb3d>]
     <build-dir>/ruby/lib/rubygems/package/tar_writer.rb:<line_a>:in `add_file_signed'
     <build-dir>/ruby/lib/rubygems/package.rb:<line_a>:in `add_metadata'
     <build-dir>/ruby/lib/rubygems/package.rb:<line_a>:in `block (2 levels) in build'
@@ 18222 @@
 
  <n>) Error:
 TestRDocRubygemsHook#test_setup:
+RuntimeError: no  in [#<Digest::SHA512: e392516336363eaac9286be44d5b95a932619711d885842376e60dd5b233908c04ec669d76badef18637f4ccd217ba9f0de3556b03709882ec620336024bdb3d>]
     <build-dir>/ruby/lib/rubygems/package/tar_writer.rb:<line_a>:in `add_file_signed'
     <build-dir>/ruby/lib/rubygems/package.rb:<line_a>:in `add_metadata'
     <build-dir>/ruby/lib/rubygems/package.rb:<line_a>:in `block (2 levels) in build'
@@ 18242 @@
 
  <n>) Error:
 TestRDocRubygemsHook#test_generate_all:
+RuntimeError: no  in [#<Digest::SHA512: e392516336363eaac9286be44d5b95a932619711d885842376e60dd5b233908c04ec669d76badef18637f4ccd217ba9f0de3556b03709882ec620336024bdb3d>]
     <build-dir>/ruby/lib/rubygems/package/tar_writer.rb:<line_a>:in `add_file_signed'
     <build-dir>/ruby/lib/rubygems/package.rb:<line_a>:in `add_metadata'
     <build-dir>/ruby/lib/rubygems/package.rb:<line_a>:in `block (2 levels) in build'
@@ 18262 @@
 
  <n>) Error:
 TestRDocRubygemsHook#test_remove:
+RuntimeError: no  in [#<Digest::SHA512: e392516336363eaac9286be44d5b95a932619711d885842376e60dd5b233908c04ec669d76badef18637f4ccd217ba9f0de3556b03709882ec620336024bdb3d>]
     <build-dir>/ruby/lib/rubygems/package/tar_writer.rb:<line_a>:in `add_file_signed'
     <build-dir>/ruby/lib/rubygems/package.rb:<line_a>:in `add_metadata'
     <build-dir>/ruby/lib/rubygems/package.rb:<line_a>:in `block (2 levels) in build'
@@ 18282 @@
 
  <n>) Error:
 TestRDocRubygemsHook#test_generate_disabled:
+RuntimeError: no  in [#<Digest::SHA512: e392516336363eaac9286be44d5b95a932619711d885842376e60dd5b233908c04ec669d76badef18637f4ccd217ba9f0de3556b03709882ec620336024bdb3d>]
     <build-dir>/ruby/lib/rubygems/package/tar_writer.rb:<line_a>:in `add_file_signed'
     <build-dir>/ruby/lib/rubygems/package.rb:<line_a>:in `add_metadata'
     <build-dir>/ruby/lib/rubygems/package.rb:<line_a>:in `block (2 levels) in build'
@@ 18302 @@
 
  <n>) Error:
 TestRDocRubygemsHook#test_generate_no_overwrite:
+RuntimeError: no  in [#<Digest::SHA512: e392516336363eaac9286be44d5b95a932619711d885842376e60dd5b233908c04ec669d76badef18637f4ccd217ba9f0de3556b03709882ec620336024bdb3d>]
     <build-dir>/ruby/lib/rubygems/package/tar_writer.rb:<line_a>:in `add_file_signed'
     <build-dir>/ruby/lib/rubygems/package.rb:<line_a>:in `add_metadata'
     <build-dir>/ruby/lib/rubygems/package.rb:<line_a>:in `block (2 levels) in build'
@@ 18322 @@
 
  <n>) Error:
 TestRDocRubygemsHook#test_initialize:
+RuntimeError: no  in [#<Digest::SHA512: e392516336363eaac9286be44d5b95a932619711d885842376e60dd5b233908c04ec669d76badef18637f4ccd217ba9f0de3556b03709882ec620336024bdb3d>]
     <build-dir>/ruby/lib/rubygems/package/tar_writer.rb:<line_a>:in `add_file_signed'
     <build-dir>/ruby/lib/rubygems/package.rb:<line_a>:in `add_metadata'
     <build-dir>/ruby/lib/rubygems/package.rb:<line_a>:in `block (2 levels) in build'
@@ 24538 @@
 /* end */
 
 "gcc -o conftest -I../../.ext/include/x86_64-linux -I../.././include -I../.././ext/openssl -DRUBY_DEBUG_ENV    -O3 -fno-fast-math -ggdb3 -Wall -Wextra -Wno-unused-parameter -Wno-parentheses -Wno-long-long -Wno-missing-field-initializers -Wunused-variable -Wpointer-arith -Wwrite-strings -Wdeclaration-after-statement -Wimplicit-function-declaration -Wdeprecated-declarations -Wno-packed-bitfield-compat conftest.c  -L. -L../.. -L. -fstack-protector -rdynamic -Wl,-export-dynamic     -Wl,-rpath,<build-dir>/lib -L<build-dir>/lib -lruby-static -lnsl  -lpthread -ldl -lcrypt -lm   -lc"
+/usr/bin/ld: <build-dir>/tmp/ccxWfz7D.o: in function `t':
 <build-dir>/ruby/ext/openssl/conftest.c:14: undefined reference to `t_open'
 collect2: error: ld returned 1 exit status
 checked program was:
@@ 24662 @@
 /* end */
 
 "gcc -o conftest -I../../.ext/include/x86_64-linux -I../.././include -I../.././ext/openssl -DRUBY_DEBUG_ENV    -O3 -fno-fast-math -ggdb3 -Wall -Wextra -Wno-unused-parameter -Wno-parentheses -Wno-long-long -Wno-missing-field-initializers -Wunused-variable -Wpointer-arith -Wwrite-strings -Wdeclaration-after-statement -Wimplicit-function-declaration -Wdeprecated-declarations -Wno-packed-bitfield-compat conftest.c  -L. -L../.. -L. -fstack-protector -rdynamic -Wl,-export-dynamic     -Wl,-rpath,<build-dir>/lib -L<build-dir>/lib -lruby-static -lcrypto  -lpthread -ldl -lcrypt -lm   -lc"
+/usr/bin/ld: <build-dir>/tmp/ccQqDbxx.o: in function `t':
 <build-dir>/ruby/ext/openssl/conftest.c:14: undefined reference to `OpenSSL_add_all_digests'
 collect2: error: ld returned 1 exit status
 checked program was:
@@ 27299 @@
 TestTempfile#test_close_with_unlink_now_true_works = <elapsed> s = .
 TestTempfile#test_concurrency = <elapsed> s = .
 TestTempfile#test_create_traversal_dir = <elapsed> s = .
+Leaked file descriptor: TestTempfile#test_create_traversal_dir: <fd> : #<File:<build-dir>/tmp/..............datachkbuildtmpbuild<buildtime>rubyfoo20190420-10491-uz092w>
 TestTempfile#test_create_with_block = <elapsed> s = .
 Closed file descriptor: <test-method>: <fd>
 TestTempfile#test_create_without_block = <elapsed> s = .
@@ 81261 @@
  <n>)
 Logger#new receives formatter as keyword argument FAILED
 Expected nil
+ to equal #<#<Class:<address>>:0x000056336ce78b78>
 
 <build-dir>/rubyspec/library/logger/logger/new_spec.rb:<line_e>:in `block (2 levels) in <top (required)>'
 <build-dir>/rubyspec/library/logger/logger/new_spec.rb:<line_a>:in `<top (required)>'

===================================================================
--- 20190419T230024Z
@@ 152 @@
 Gid:	1003	1003	1003	1003
 FDSize:	64
 Groups:	1003
-NStgid:	3739
-NSpid:	3739
-NSpgid:	3739
-NSsid:	23942
 VmPeak: <nnn> kB
 VmSize: <nnn> kB
 VmLck: <nnn> kB
 VmPin:	       0 kB
 VmHWM: <nnn> kB
 VmRSS: <nnn> kB
-RssAnon:	      68 kB
-RssFile:	     624 kB
 RssShmem:	       0 kB
 VmData: <nnn> kB
 VmStk: <nnn> kB
@@ 17982 @@
 
  <n>) Error:
 TestRDocRubygemsHook#test_new_rdoc:
-RuntimeError: no  in [#<Digest::SHA512: 96340e42e1c94242462ce903cfb73b63132905ec5739239b20b46e61f1f32ea970e02b11eb0285aecd77a47f340c4326a0ce8af9a420afe504932504c8af9621>]
     <build-dir>/ruby/lib/rubygems/package/tar_writer.rb:<line_a>:in `add_file_signed'
     <build-dir>/ruby/lib/rubygems/package.rb:<line_a>:in `add_metadata'
     <build-dir>/ruby/lib/rubygems/package.rb:<line_a>:in `block (2 levels) in build'
@@ 18002 @@
 
  <n>) Error:
 TestRDocRubygemsHook#test_rdoc_installed?:
-RuntimeError: no  in [#<Digest::SHA512: 96340e42e1c94242462ce903cfb73b63132905ec5739239b20b46e61f1f32ea970e02b11eb0285aecd77a47f340c4326a0ce8af9a420afe504932504c8af9621>]
     <build-dir>/ruby/lib/rubygems/package/tar_writer.rb:<line_a>:in `add_file_signed'
     <build-dir>/ruby/lib/rubygems/package.rb:<line_a>:in `add_metadata'
     <build-dir>/ruby/lib/rubygems/package.rb:<line_a>:in `block (2 levels) in build'
@@ 18022 @@
 
  <n>) Error:
 TestRDocRubygemsHook#test_document:
-RuntimeError: no  in [#<Digest::SHA512: 96340e42e1c94242462ce903cfb73b63132905ec5739239b20b46e61f1f32ea970e02b11eb0285aecd77a47f340c4326a0ce8af9a420afe504932504c8af9621>]
     <build-dir>/ruby/lib/rubygems/package/tar_writer.rb:<line_a>:in `add_file_signed'
     <build-dir>/ruby/lib/rubygems/package.rb:<line_a>:in `add_metadata'
     <build-dir>/ruby/lib/rubygems/package.rb:<line_a>:in `block (2 levels) in build'
@@ 18042 @@
 
  <n>) Error:
 TestRDocRubygemsHook#test_generate_no_overwrite:
-RuntimeError: no  in [#<Digest::SHA512: 96340e42e1c94242462ce903cfb73b63132905ec5739239b20b46e61f1f32ea970e02b11eb0285aecd77a47f340c4326a0ce8af9a420afe504932504c8af9621>]
     <build-dir>/ruby/lib/rubygems/package/tar_writer.rb:<line_a>:in `add_file_signed'
     <build-dir>/ruby/lib/rubygems/package.rb:<line_a>:in `add_metadata'
     <build-dir>/ruby/lib/rubygems/package.rb:<line_a>:in `block (2 levels) in build'
@@ 18062 @@
 
  <n>) Error:
 TestRDocRubygemsHook#test_generate:
-RuntimeError: no  in [#<Digest::SHA512: 96340e42e1c94242462ce903cfb73b63132905ec5739239b20b46e61f1f32ea970e02b11eb0285aecd77a47f340c4326a0ce8af9a420afe504932504c8af9621>]
     <build-dir>/ruby/lib/rubygems/package/tar_writer.rb:<line_a>:in `add_file_signed'
     <build-dir>/ruby/lib/rubygems/package.rb:<line_a>:in `add_metadata'
     <build-dir>/ruby/lib/rubygems/package.rb:<line_a>:in `block (2 levels) in build'
@@ 18082 @@
 
  <n>) Error:
 TestRDocRubygemsHook#test_delete_legacy_args:
-RuntimeError: no  in [#<Digest::SHA512: 96340e42e1c94242462ce903cfb73b63132905ec5739239b20b46e61f1f32ea970e02b11eb0285aecd77a47f340c4326a0ce8af9a420afe504932504c8af9621>]
     <build-dir>/ruby/lib/rubygems/package/tar_writer.rb:<line_a>:in `add_file_signed'
     <build-dir>/ruby/lib/rubygems/package.rb:<line_a>:in `add_metadata'
     <build-dir>/ruby/lib/rubygems/package.rb:<line_a>:in `block (2 levels) in build'
@@ 18102 @@
 
  <n>) Error:
 TestRDocRubygemsHook#test_ri_installed?:
-RuntimeError: no  in [#<Digest::SHA512: 96340e42e1c94242462ce903cfb73b63132905ec5739239b20b46e61f1f32ea970e02b11eb0285aecd77a47f340c4326a0ce8af9a420afe504932504c8af9621>]
     <build-dir>/ruby/lib/rubygems/package/tar_writer.rb:<line_a>:in `add_file_signed'
     <build-dir>/ruby/lib/rubygems/package.rb:<line_a>:in `add_metadata'
     <build-dir>/ruby/lib/rubygems/package.rb:<line_a>:in `block (2 levels) in build'
@@ 18122 @@
 
  <n>) Error:
 TestRDocRubygemsHook#test_setup:
-RuntimeError: no  in [#<Digest::SHA512: 96340e42e1c94242462ce903cfb73b63132905ec5739239b20b46e61f1f32ea970e02b11eb0285aecd77a47f340c4326a0ce8af9a420afe504932504c8af9621>]
     <build-dir>/ruby/lib/rubygems/package/tar_writer.rb:<line_a>:in `add_file_signed'
     <build-dir>/ruby/lib/rubygems/package.rb:<line_a>:in `add_metadata'
     <build-dir>/ruby/lib/rubygems/package.rb:<line_a>:in `block (2 levels) in build'
@@ 18142 @@
 
  <n>) Error:
 TestRDocRubygemsHook#test_remove_unwritable:
-RuntimeError: no  in [#<Digest::SHA512: 96340e42e1c94242462ce903cfb73b63132905ec5739239b20b46e61f1f32ea970e02b11eb0285aecd77a47f340c4326a0ce8af9a420afe504932504c8af9621>]
     <build-dir>/ruby/lib/rubygems/package/tar_writer.rb:<line_a>:in `add_file_signed'
     <build-dir>/ruby/lib/rubygems/package.rb:<line_a>:in `add_metadata'
     <build-dir>/ruby/lib/rubygems/package.rb:<line_a>:in `block (2 levels) in build'
@@ 18162 @@
 
  <n>) Error:
 TestRDocRubygemsHook#test_generate_all:
-RuntimeError: no  in [#<Digest::SHA512: 96340e42e1c94242462ce903cfb73b63132905ec5739239b20b46e61f1f32ea970e02b11eb0285aecd77a47f340c4326a0ce8af9a420afe504932504c8af9621>]
     <build-dir>/ruby/lib/rubygems/package/tar_writer.rb:<line_a>:in `add_file_signed'
     <build-dir>/ruby/lib/rubygems/package.rb:<line_a>:in `add_metadata'
     <build-dir>/ruby/lib/rubygems/package.rb:<line_a>:in `block (2 levels) in build'
@@ 18182 @@
 
  <n>) Error:
 TestRDocRubygemsHook#test_remove:
-RuntimeError: no  in [#<Digest::SHA512: 96340e42e1c94242462ce903cfb73b63132905ec5739239b20b46e61f1f32ea970e02b11eb0285aecd77a47f340c4326a0ce8af9a420afe504932504c8af9621>]
     <build-dir>/ruby/lib/rubygems/package/tar_writer.rb:<line_a>:in `add_file_signed'
     <build-dir>/ruby/lib/rubygems/package.rb:<line_a>:in `add_metadata'
     <build-dir>/ruby/lib/rubygems/package.rb:<line_a>:in `block (2 levels) in build'
@@ 18202 @@
 
  <n>) Error:
 TestRDocRubygemsHook#test_generate_configuration_rdoc_array:
-RuntimeError: no  in [#<Digest::SHA512: 96340e42e1c94242462ce903cfb73b63132905ec5739239b20b46e61f1f32ea970e02b11eb0285aecd77a47f340c4326a0ce8af9a420afe504932504c8af9621>]
     <build-dir>/ruby/lib/rubygems/package/tar_writer.rb:<line_a>:in `add_file_signed'
     <build-dir>/ruby/lib/rubygems/package.rb:<line_a>:in `add_metadata'
     <build-dir>/ruby/lib/rubygems/package.rb:<line_a>:in `block (2 levels) in build'
@@ 18222 @@
 
  <n>) Error:
 TestRDocRubygemsHook#test_initialize:
-RuntimeError: no  in [#<Digest::SHA512: 96340e42e1c94242462ce903cfb73b63132905ec5739239b20b46e61f1f32ea970e02b11eb0285aecd77a47f340c4326a0ce8af9a420afe504932504c8af9621>]
     <build-dir>/ruby/lib/rubygems/package/tar_writer.rb:<line_a>:in `add_file_signed'
     <build-dir>/ruby/lib/rubygems/package.rb:<line_a>:in `add_metadata'
     <build-dir>/ruby/lib/rubygems/package.rb:<line_a>:in `block (2 levels) in build'
@@ 18242 @@
 
  <n>) Error:
 TestRDocRubygemsHook#test_generate_default_gem:
-RuntimeError: no  in [#<Digest::SHA512: 96340e42e1c94242462ce903cfb73b63132905ec5739239b20b46e61f1f32ea970e02b11eb0285aecd77a47f340c4326a0ce8af9a420afe504932504c8af9621>]
     <build-dir>/ruby/lib/rubygems/package/tar_writer.rb:<line_a>:in `add_file_signed'
     <build-dir>/ruby/lib/rubygems/package.rb:<line_a>:in `add_metadata'
     <build-dir>/ruby/lib/rubygems/package.rb:<line_a>:in `block (2 levels) in build'
@@ 18262 @@
 
  <n>) Error:
 TestRDocRubygemsHook#test_setup_unwritable:
-RuntimeError: no  in [#<Digest::SHA512: 96340e42e1c94242462ce903cfb73b63132905ec5739239b20b46e61f1f32ea970e02b11eb0285aecd77a47f340c4326a0ce8af9a420afe504932504c8af9621>]
     <build-dir>/ruby/lib/rubygems/package/tar_writer.rb:<line_a>:in `add_file_signed'
     <build-dir>/ruby/lib/rubygems/package.rb:<line_a>:in `add_metadata'
     <build-dir>/ruby/lib/rubygems/package.rb:<line_a>:in `block (2 levels) in build'
@@ 18282 @@
 
  <n>) Error:
 TestRDocRubygemsHook#test_generate_disabled:
-RuntimeError: no  in [#<Digest::SHA512: 96340e42e1c94242462ce903cfb73b63132905ec5739239b20b46e61f1f32ea970e02b11eb0285aecd77a47f340c4326a0ce8af9a420afe504932504c8af9621>]
     <build-dir>/ruby/lib/rubygems/package/tar_writer.rb:<line_a>:in `add_file_signed'
     <build-dir>/ruby/lib/rubygems/package.rb:<line_a>:in `add_metadata'
     <build-dir>/ruby/lib/rubygems/package.rb:<line_a>:in `block (2 levels) in build'
@@ 18302 @@
 
  <n>) Error:
 TestRDocRubygemsHook#test_generate_force:
-RuntimeError: no  in [#<Digest::SHA512: 96340e42e1c94242462ce903cfb73b63132905ec5739239b20b46e61f1f32ea970e02b11eb0285aecd77a47f340c4326a0ce8af9a420afe504932504c8af9621>]
     <build-dir>/ruby/lib/rubygems/package/tar_writer.rb:<line_a>:in `add_file_signed'
     <build-dir>/ruby/lib/rubygems/package.rb:<line_a>:in `add_metadata'
     <build-dir>/ruby/lib/rubygems/package.rb:<line_a>:in `block (2 levels) in build'
@@ 18322 @@
 
  <n>) Error:
 TestRDocRubygemsHook#test_generate_configuration_rdoc_string:
-RuntimeError: no  in [#<Digest::SHA512: 96340e42e1c94242462ce903cfb73b63132905ec5739239b20b46e61f1f32ea970e02b11eb0285aecd77a47f340c4326a0ce8af9a420afe504932504c8af9621>]
     <build-dir>/ruby/lib/rubygems/package/tar_writer.rb:<line_a>:in `add_file_signed'
     <build-dir>/ruby/lib/rubygems/package.rb:<line_a>:in `add_metadata'
     <build-dir>/ruby/lib/rubygems/package.rb:<line_a>:in `block (2 levels) in build'
@@ 24538 @@
 /* end */
 
 "gcc -o conftest -I../../.ext/include/x86_64-linux -I../.././include -I../.././ext/openssl -DRUBY_DEBUG_ENV    -O3 -fno-fast-math -ggdb3 -Wall -Wextra -Wno-unused-parameter -Wno-parentheses -Wno-long-long -Wno-missing-field-initializers -Wunused-variable -Wpointer-arith -Wwrite-strings -Wdeclaration-after-statement -Wimplicit-function-declaration -Wdeprecated-declarations -Wno-packed-bitfield-compat conftest.c  -L. -L../.. -L. -fstack-protector -rdynamic -Wl,-export-dynamic     -Wl,-rpath,<build-dir>/lib -L<build-dir>/lib -lruby-static -lnsl  -lpthread -ldl -lcrypt -lm   -lc"
-/usr/bin/ld: <build-dir>/tmp/ccgduyNY.o: in function `t':
 <build-dir>/ruby/ext/openssl/conftest.c:14: undefined reference to `t_open'
 collect2: error: ld returned 1 exit status
 checked program was:
@@ 24662 @@
 /* end */
 
 "gcc -o conftest -I../../.ext/include/x86_64-linux -I../.././include -I../.././ext/openssl -DRUBY_DEBUG_ENV    -O3 -fno-fast-math -ggdb3 -Wall -Wextra -Wno-unused-parameter -Wno-parentheses -Wno-long-long -Wno-missing-field-initializers -Wunused-variable -Wpointer-arith -Wwrite-strings -Wdeclaration-after-statement -Wimplicit-function-declaration -Wdeprecated-declarations -Wno-packed-bitfield-compat conftest.c  -L. -L../.. -L. -fstack-protector -rdynamic -Wl,-export-dynamic     -Wl,-rpath,<build-dir>/lib -L<build-dir>/lib -lruby-static -lcrypto  -lpthread -ldl -lcrypt -lm   -lc"
-/usr/bin/ld: <build-dir>/tmp/ccPwvG8D.o: in function `t':
 <build-dir>/ruby/ext/openssl/conftest.c:14: undefined reference to `OpenSSL_add_all_digests'
 collect2: error: ld returned 1 exit status
 checked program was:
@@ 27299 @@
 TestTempfile#test_close_with_unlink_now_true_works = <elapsed> s = .
 TestTempfile#test_concurrency = <elapsed> s = .
 TestTempfile#test_create_traversal_dir = <elapsed> s = .
-Leaked file descriptor: TestTempfile#test_create_traversal_dir: <fd> : #<File:<build-dir>/tmp/..............datachkbuildtmpbuild<buildtime>rubyfoo20190419-14495-1d5gik>
 TestTempfile#test_create_with_block = <elapsed> s = .
 Closed file descriptor: <test-method>: <fd>
 TestTempfile#test_create_without_block = <elapsed> s = .
@@ 81261 @@
  <n>)
 Logger#new receives formatter as keyword argument FAILED
 Expected nil
- to equal #<#<Class:<address>>:0x000055a3cbc73110>
 
 <build-dir>/rubyspec/library/logger/logger/new_spec.rb:<line_e>:in `block (2 levels) in <top (required)>'
 <build-dir>/rubyspec/library/logger/logger/new_spec.rb:<line_a>:in `<top (required)>'

OlderDiff < 20190419T230024Z(failure) < ThisDiff > 20190420T020129Z(failure)


chkbuild summary recent last