r65135 ruby 2.3.8p459 (2018-10-18) [x86_64-linux] [2.3] (ubuntu) 1024W failed(test-all) 4failed(test/) rubyspec:4F7E

chkbuild summary recent last

20181104T133514Z(failure) < OlderDiff < 20181104T163428Z(failure) > NewerDiff > 20181104T193318Z(failure)

== test-all # 2018-11-04T16:42:05+00:00 (full)
...(snip 167 lines)...
	from /data/chkbuild/tmp/build/20181104T163428Z/ruby/test/lib/test/unit.rb:827:in `non_options'
	from /data/chkbuild/tmp/build/20181104T163428Z/ruby/test/lib/test/unit.rb:64:in `process_args'
	from /data/chkbuild/tmp/build/20181104T163428Z/ruby/test/lib/test/unit.rb:130:in `process_args'
	from /data/chkbuild/tmp/build/20181104T163428Z/ruby/test/lib/test/unit.rb:972:in `process_args'
	from /data/chkbuild/tmp/build/20181104T163428Z/ruby/test/lib/test/unit.rb:977:in `run'
	from /data/chkbuild/tmp/build/20181104T163428Z/ruby/test/lib/test/unit.rb:984:in `run'
	from ./test/runner.rb:40:in `<main>'
make: *** [uncommon.mk:605: yes-test-all] Error 1
exit 2
failed(test-all)
== test/net # 2018-11-04T16:42:54+00:00 (full)
...(snip 273 lines)...
TestPOP#test_apop_ng = 0.00 s = .
TestPOP#test_apop_ok = 0.00 s = .
TestPOP#test_pop_auth_ng = 0.00 s = .
TestPOP#test_pop_auth_ok = 0.00 s = .
TestProtocol#test_each_crlf_line = 0.00 s = .
TestProtocol#test_should_properly_dot_stuff_period_with_no_endline = 0.00 s = .


Finished tests in 11.932913s, 20.3638 tests/s, 165.7600 assertions/s.

  1) Error:
Net::TestSMTP#test_tls_connect:
LoadError: cannot load such file -- openssl
    /data/chkbuild/tmp/build/20181104T163428Z/ruby/test/net/smtp/test_smtp.rb:108:in `require'
    /data/chkbuild/tmp/build/20181104T163428Z/ruby/test/net/smtp/test_smtp.rb:108:in `test_tls_connect'

  2) Error:
Net::TestSMTP#test_tls_connect_timeout:
LoadError: cannot load such file -- openssl
    /data/chkbuild/tmp/build/20181104T163428Z/ruby/lib/net/smtp.rb:197:in `require'
    /data/chkbuild/tmp/build/20181104T163428Z/ruby/lib/net/smtp.rb:197:in `default_ssl_context'
    /data/chkbuild/tmp/build/20181104T163428Z/ruby/lib/net/smtp.rb:299:in `enable_tls'
    /data/chkbuild/tmp/build/20181104T163428Z/ruby/test/net/smtp/test_smtp.rb:148:in `test_tls_connect_timeout'

243 tests, 1978 assertions, 0 failures, 2 errors, 0 skips

ruby -v: ruby 2.3.8p459 (2018-10-18 revision 65135) [x86_64-linux]
make: *** [uncommon.mk:605: yes-test-all] Error 2
exit 2
failed(test/net)
== test/rdoc # 2018-11-04T16:43:10+00:00 (full)
...(snip 2149 lines)...
TestRDocTopLevel#test_display_eh = 0.01 s = .
TestRDocTopLevel#test_add_alias_nodoc = 0.01 s = .
TestRDocTopLevel#test_add_include_nodoc = 0.01 s = .
TestRDocTopLevel#test_add_method_stopdoc = 0.01 s = .
TestRDocTopLevel#test_add_include = 0.01 s = .
TestRDocTopLevel#test_search_record = 0.01 s = .


Finished tests in 9.029851s, 235.9950 tests/s, 557.1521 assertions/s.

  1) Error:
TestRDocRubygemsHook#test_generate_default_gem:
RuntimeError: no  in [#<Digest::SHA512: aacdafc5652a76014c2f179f44a5092cb4b7dcc7e54e1367bf2dc70492f9d12e7e90874c729b13e42000400d743686b7b87db76eaaf9b37d3031565f2e355ce8>]
    /data/chkbuild/tmp/build/20181104T163428Z/ruby/lib/rubygems/package/tar_writer.rb:199:in `add_file_signed'
    /data/chkbuild/tmp/build/20181104T163428Z/ruby/lib/rubygems/package.rb:231:in `add_metadata'
    /data/chkbuild/tmp/build/20181104T163428Z/ruby/lib/rubygems/package.rb:254:in `block (2 levels) in build'
    /data/chkbuild/tmp/build/20181104T163428Z/ruby/lib/rubygems/package/tar_writer.rb:86:in `new'
    /data/chkbuild/tmp/build/20181104T163428Z/ruby/lib/rubygems/package.rb:253:in `block in build'
    /data/chkbuild/tmp/build/20181104T163428Z/ruby/lib/rubygems/package/file_source.rb:26:in `open'
    /data/chkbuild/tmp/build/20181104T163428Z/ruby/lib/rubygems/package/file_source.rb:26:in `with_write_io'
    /data/chkbuild/tmp/build/20181104T163428Z/ruby/lib/rubygems/package.rb:252:in `build'
    /data/chkbuild/tmp/build/20181104T163428Z/ruby/lib/rubygems/package.rb:115:in `build'
    /data/chkbuild/tmp/build/20181104T163428Z/ruby/lib/rubygems/test_case.rb:511:in `block (2 levels) in install_gem'
    /data/chkbuild/tmp/build/20181104T163428Z/ruby/lib/rubygems/test_case.rb:510:in `chdir'
    /data/chkbuild/tmp/build/20181104T163428Z/ruby/lib/rubygems/test_case.rb:510:in `block in install_gem'
    /data/chkbuild/tmp/build/20181104T163428Z/ruby/lib/rubygems/user_interaction.rb:46:in `use_ui'
    /data/chkbuild/tmp/build/20181104T163428Z/ruby/lib/rubygems/user_interaction.rb:69:in `use_ui'
    /data/chkbuild/tmp/build/20181104T163428Z/ruby/lib/rubygems/test_case.rb:509:in `install_gem'
    /data/chkbuild/tmp/build/20181104T163428Z/ruby/test/rdoc/test_rdoc_rubygems_hook.rb:22:in `setup'

  2) Error:
TestRDocRubygemsHook#test_generate_disabled:
RuntimeError: no  in [#<Digest::SHA512: aacdafc5652a76014c2f179f44a5092cb4b7dcc7e54e1367bf2dc70492f9d12e7e90874c729b13e42000400d743686b7b87db76eaaf9b37d3031565f2e355ce8>]
    /data/chkbuild/tmp/build/20181104T163428Z/ruby/lib/rubygems/package/tar_writer.rb:199:in `add_file_signed'
    /data/chkbuild/tmp/build/20181104T163428Z/ruby/lib/rubygems/package.rb:231:in `add_metadata'
    /data/chkbuild/tmp/build/20181104T163428Z/ruby/lib/rubygems/package.rb:254:in `block (2 levels) in build'
    /data/chkbuild/tmp/build/20181104T163428Z/ruby/lib/rubygems/package/tar_writer.rb:86:in `new'
    /data/chkbuild/tmp/build/20181104T163428Z/ruby/lib/rubygems/package.rb:253:in `block in build'
    /data/chkbuild/tmp/build/20181104T163428Z/ruby/lib/rubygems/package/file_source.rb:26:in `open'
    /data/chkbuild/tmp/build/20181104T163428Z/ruby/lib/rubygems/package/file_source.rb:26:in `with_write_io'
    /data/chkbuild/tmp/build/20181104T163428Z/ruby/lib/rubygems/package.rb:252:in `build'
    /data/chkbuild/tmp/build/20181104T163428Z/ruby/lib/rubygems/package.rb:115:in `build'
    /data/chkbuild/tmp/build/20181104T163428Z/ruby/lib/rubygems/test_case.rb:511:in `block (2 levels) in install_gem'
    /data/chkbuild/tmp/build/20181104T163428Z/ruby/lib/rubygems/test_case.rb:510:in `chdir'
    /data/chkbuild/tmp/build/20181104T163428Z/ruby/lib/rubygems/test_case.rb:510:in `block in install_gem'
    /data/chkbuild/tmp/build/20181104T163428Z/ruby/lib/rubygems/user_interaction.rb:46:in `use_ui'
    /data/chkbuild/tmp/build/20181104T163428Z/ruby/lib/rubygems/user_interaction.rb:69:in `use_ui'
    /data/chkbuild/tmp/build/20181104T163428Z/ruby/lib/rubygems/test_case.rb:509:in `install_gem'
    /data/chkbuild/tmp/build/20181104T163428Z/ruby/test/rdoc/test_rdoc_rubygems_hook.rb:22:in `setup'

  3) Error:
TestRDocRubygemsHook#test_generate_no_overwrite:
RuntimeError: no  in [#<Digest::SHA512: aacdafc5652a76014c2f179f44a5092cb4b7dcc7e54e1367bf2dc70492f9d12e7e90874c729b13e42000400d743686b7b87db76eaaf9b37d3031565f2e355ce8>]
    /data/chkbuild/tmp/build/20181104T163428Z/ruby/lib/rubygems/package/tar_writer.rb:199:in `add_file_signed'
    /data/chkbuild/tmp/build/20181104T163428Z/ruby/lib/rubygems/package.rb:231:in `add_metadata'
    /data/chkbuild/tmp/build/20181104T163428Z/ruby/lib/rubygems/package.rb:254:in `block (2 levels) in build'
    /data/chkbuild/tmp/build/20181104T163428Z/ruby/lib/rubygems/package/tar_writer.rb:86:in `new'
    /data/chkbuild/tmp/build/20181104T163428Z/ruby/lib/rubygems/package.rb:253:in `block in build'
    /data/chkbuild/tmp/build/20181104T163428Z/ruby/lib/rubygems/package/file_source.rb:26:in `open'
    /data/chkbuild/tmp/build/20181104T163428Z/ruby/lib/rubygems/package/file_source.rb:26:in `with_write_io'
    /data/chkbuild/tmp/build/20181104T163428Z/ruby/lib/rubygems/package.rb:252:in `build'
    /data/chkbuild/tmp/build/20181104T163428Z/ruby/lib/rubygems/package.rb:115:in `build'
    /data/chkbuild/tmp/build/20181104T163428Z/ruby/lib/rubygems/test_case.rb:511:in `block (2 levels) in install_gem'
    /data/chkbuild/tmp/build/20181104T163428Z/ruby/lib/rubygems/test_case.rb:510:in `chdir'
    /data/chkbuild/tmp/build/20181104T163428Z/ruby/lib/rubygems/test_case.rb:510:in `block in install_gem'
    /data/chkbuild/tmp/build/20181104T163428Z/ruby/lib/rubygems/user_interaction.rb:46:in `use_ui'
    /data/chkbuild/tmp/build/20181104T163428Z/ruby/lib/rubygems/user_interaction.rb:69:in `use_ui'
    /data/chkbuild/tmp/build/20181104T163428Z/ruby/lib/rubygems/test_case.rb:509:in `install_gem'
    /data/chkbuild/tmp/build/20181104T163428Z/ruby/test/rdoc/test_rdoc_rubygems_hook.rb:22:in `setup'

  4) Error:
TestRDocRubygemsHook#test_initialize:
RuntimeError: no  in [#<Digest::SHA512: aacdafc5652a76014c2f179f44a5092cb4b7dcc7e54e1367bf2dc70492f9d12e7e90874c729b13e42000400d743686b7b87db76eaaf9b37d3031565f2e355ce8>]
    /data/chkbuild/tmp/build/20181104T163428Z/ruby/lib/rubygems/package/tar_writer.rb:199:in `add_file_signed'
    /data/chkbuild/tmp/build/20181104T163428Z/ruby/lib/rubygems/package.rb:231:in `add_metadata'
    /data/chkbuild/tmp/build/20181104T163428Z/ruby/lib/rubygems/package.rb:254:in `block (2 levels) in build'
    /data/chkbuild/tmp/build/20181104T163428Z/ruby/lib/rubygems/package/tar_writer.rb:86:in `new'
    /data/chkbuild/tmp/build/20181104T163428Z/ruby/lib/rubygems/package.rb:253:in `block in build'
    /data/chkbuild/tmp/build/20181104T163428Z/ruby/lib/rubygems/package/file_source.rb:26:in `open'
    /data/chkbuild/tmp/build/20181104T163428Z/ruby/lib/rubygems/package/file_source.rb:26:in `with_write_io'
    /data/chkbuild/tmp/build/20181104T163428Z/ruby/lib/rubygems/package.rb:252:in `build'
    /data/chkbuild/tmp/build/20181104T163428Z/ruby/lib/rubygems/package.rb:115:in `build'
    /data/chkbuild/tmp/build/20181104T163428Z/ruby/lib/rubygems/test_case.rb:511:in `block (2 levels) in install_gem'
    /data/chkbuild/tmp/build/20181104T163428Z/ruby/lib/rubygems/test_case.rb:510:in `chdir'
    /data/chkbuild/tmp/build/20181104T163428Z/ruby/lib/rubygems/test_case.rb:510:in `block in install_gem'
    /data/chkbuild/tmp/build/20181104T163428Z/ruby/lib/rubygems/user_interaction.rb:46:in `use_ui'
    /data/chkbuild/tmp/build/20181104T163428Z/ruby/lib/rubygems/user_interaction.rb:69:in `use_ui'
    /data/chkbuild/tmp/build/20181104T163428Z/ruby/lib/rubygems/test_case.rb:509:in `install_gem'
    /data/chkbuild/tmp/build/20181104T163428Z/ruby/test/rdoc/test_rdoc_rubygems_hook.rb:22:in `setup'

  5) Error:
TestRDocRubygemsHook#test_setup_unwritable:
RuntimeError: no  in [#<Digest::SHA512: aacdafc5652a76014c2f179f44a5092cb4b7dcc7e54e1367bf2dc70492f9d12e7e90874c729b13e42000400d743686b7b87db76eaaf9b37d3031565f2e355ce8>]
    /data/chkbuild/tmp/build/20181104T163428Z/ruby/lib/rubygems/package/tar_writer.rb:199:in `add_file_signed'
    /data/chkbuild/tmp/build/20181104T163428Z/ruby/lib/rubygems/package.rb:231:in `add_metadata'
    /data/chkbuild/tmp/build/20181104T163428Z/ruby/lib/rubygems/package.rb:254:in `block (2 levels) in build'
    /data/chkbuild/tmp/build/20181104T163428Z/ruby/lib/rubygems/package/tar_writer.rb:86:in `new'
    /data/chkbuild/tmp/build/20181104T163428Z/ruby/lib/rubygems/package.rb:253:in `block in build'
    /data/chkbuild/tmp/build/20181104T163428Z/ruby/lib/rubygems/package/file_source.rb:26:in `open'
    /data/chkbuild/tmp/build/20181104T163428Z/ruby/lib/rubygems/package/file_source.rb:26:in `with_write_io'
    /data/chkbuild/tmp/build/20181104T163428Z/ruby/lib/rubygems/package.rb:252:in `build'
    /data/chkbuild/tmp/build/20181104T163428Z/ruby/lib/rubygems/package.rb:115:in `build'
    /data/chkbuild/tmp/build/20181104T163428Z/ruby/lib/rubygems/test_case.rb:511:in `block (2 levels) in install_gem'
    /data/chkbuild/tmp/build/20181104T163428Z/ruby/lib/rubygems/test_case.rb:510:in `chdir'
    /data/chkbuild/tmp/build/20181104T163428Z/ruby/lib/rubygems/test_case.rb:510:in `block in install_gem'
    /data/chkbuild/tmp/build/20181104T163428Z/ruby/lib/rubygems/user_interaction.rb:46:in `use_ui'
    /data/chkbuild/tmp/build/20181104T163428Z/ruby/lib/rubygems/user_interaction.rb:69:in `use_ui'
    /data/chkbuild/tmp/build/20181104T163428Z/ruby/lib/rubygems/test_case.rb:509:in `install_gem'
    /data/chkbuild/tmp/build/20181104T163428Z/ruby/test/rdoc/test_rdoc_rubygems_hook.rb:22:in `setup'

  6) Error:
TestRDocRubygemsHook#test_generate_force:
RuntimeError: no  in [#<Digest::SHA512: aacdafc5652a76014c2f179f44a5092cb4b7dcc7e54e1367bf2dc70492f9d12e7e90874c729b13e42000400d743686b7b87db76eaaf9b37d3031565f2e355ce8>]
    /data/chkbuild/tmp/build/20181104T163428Z/ruby/lib/rubygems/package/tar_writer.rb:199:in `add_file_signed'
    /data/chkbuild/tmp/build/20181104T163428Z/ruby/lib/rubygems/package.rb:231:in `add_metadata'
    /data/chkbuild/tmp/build/20181104T163428Z/ruby/lib/rubygems/package.rb:254:in `block (2 levels) in build'
    /data/chkbuild/tmp/build/20181104T163428Z/ruby/lib/rubygems/package/tar_writer.rb:86:in `new'
    /data/chkbuild/tmp/build/20181104T163428Z/ruby/lib/rubygems/package.rb:253:in `block in build'
    /data/chkbuild/tmp/build/20181104T163428Z/ruby/lib/rubygems/package/file_source.rb:26:in `open'
    /data/chkbuild/tmp/build/20181104T163428Z/ruby/lib/rubygems/package/file_source.rb:26:in `with_write_io'
    /data/chkbuild/tmp/build/20181104T163428Z/ruby/lib/rubygems/package.rb:252:in `build'
    /data/chkbuild/tmp/build/20181104T163428Z/ruby/lib/rubygems/package.rb:115:in `build'
    /data/chkbuild/tmp/build/20181104T163428Z/ruby/lib/rubygems/test_case.rb:511:in `block (2 levels) in install_gem'
    /data/chkbuild/tmp/build/20181104T163428Z/ruby/lib/rubygems/test_case.rb:510:in `chdir'
    /data/chkbuild/tmp/build/20181104T163428Z/ruby/lib/rubygems/test_case.rb:510:in `block in install_gem'
    /data/chkbuild/tmp/build/20181104T163428Z/ruby/lib/rubygems/user_interaction.rb:46:in `use_ui'
    /data/chkbuild/tmp/build/20181104T163428Z/ruby/lib/rubygems/user_interaction.rb:69:in `use_ui'
    /data/chkbuild/tmp/build/20181104T163428Z/ruby/lib/rubygems/test_case.rb:509:in `install_gem'
    /data/chkbuild/tmp/build/20181104T163428Z/ruby/test/rdoc/test_rdoc_rubygems_hook.rb:22:in `setup'

  7) Error:
TestRDocRubygemsHook#test_remove:
RuntimeError: no  in [#<Digest::SHA512: aacdafc5652a76014c2f179f44a5092cb4b7dcc7e54e1367bf2dc70492f9d12e7e90874c729b13e42000400d743686b7b87db76eaaf9b37d3031565f2e355ce8>]
    /data/chkbuild/tmp/build/20181104T163428Z/ruby/lib/rubygems/package/tar_writer.rb:199:in `add_file_signed'
    /data/chkbuild/tmp/build/20181104T163428Z/ruby/lib/rubygems/package.rb:231:in `add_metadata'
    /data/chkbuild/tmp/build/20181104T163428Z/ruby/lib/rubygems/package.rb:254:in `block (2 levels) in build'
    /data/chkbuild/tmp/build/20181104T163428Z/ruby/lib/rubygems/package/tar_writer.rb:86:in `new'
    /data/chkbuild/tmp/build/20181104T163428Z/ruby/lib/rubygems/package.rb:253:in `block in build'
    /data/chkbuild/tmp/build/20181104T163428Z/ruby/lib/rubygems/package/file_source.rb:26:in `open'
    /data/chkbuild/tmp/build/20181104T163428Z/ruby/lib/rubygems/package/file_source.rb:26:in `with_write_io'
    /data/chkbuild/tmp/build/20181104T163428Z/ruby/lib/rubygems/package.rb:252:in `build'
    /data/chkbuild/tmp/build/20181104T163428Z/ruby/lib/rubygems/package.rb:115:in `build'
    /data/chkbuild/tmp/build/20181104T163428Z/ruby/lib/rubygems/test_case.rb:511:in `block (2 levels) in install_gem'
    /data/chkbuild/tmp/build/20181104T163428Z/ruby/lib/rubygems/test_case.rb:510:in `chdir'
    /data/chkbuild/tmp/build/20181104T163428Z/ruby/lib/rubygems/test_case.rb:510:in `block in install_gem'
    /data/chkbuild/tmp/build/20181104T163428Z/ruby/lib/rubygems/user_interaction.rb:46:in `use_ui'
    /data/chkbuild/tmp/build/20181104T163428Z/ruby/lib/rubygems/user_interaction.rb:69:in `use_ui'
    /data/chkbuild/tmp/build/20181104T163428Z/ruby/lib/rubygems/test_case.rb:509:in `install_gem'
    /data/chkbuild/tmp/build/20181104T163428Z/ruby/test/rdoc/test_rdoc_rubygems_hook.rb:22:in `setup'

  8) Error:
TestRDocRubygemsHook#test_generate:
RuntimeError: no  in [#<Digest::SHA512: aacdafc5652a76014c2f179f44a5092cb4b7dcc7e54e1367bf2dc70492f9d12e7e90874c729b13e42000400d743686b7b87db76eaaf9b37d3031565f2e355ce8>]
    /data/chkbuild/tmp/build/20181104T163428Z/ruby/lib/rubygems/package/tar_writer.rb:199:in `add_file_signed'
    /data/chkbuild/tmp/build/20181104T163428Z/ruby/lib/rubygems/package.rb:231:in `add_metadata'
    /data/chkbuild/tmp/build/20181104T163428Z/ruby/lib/rubygems/package.rb:254:in `block (2 levels) in build'
    /data/chkbuild/tmp/build/20181104T163428Z/ruby/lib/rubygems/package/tar_writer.rb:86:in `new'
    /data/chkbuild/tmp/build/20181104T163428Z/ruby/lib/rubygems/package.rb:253:in `block in build'
    /data/chkbuild/tmp/build/20181104T163428Z/ruby/lib/rubygems/package/file_source.rb:26:in `open'
    /data/chkbuild/tmp/build/20181104T163428Z/ruby/lib/rubygems/package/file_source.rb:26:in `with_write_io'
    /data/chkbuild/tmp/build/20181104T163428Z/ruby/lib/rubygems/package.rb:252:in `build'
    /data/chkbuild/tmp/build/20181104T163428Z/ruby/lib/rubygems/package.rb:115:in `build'
    /data/chkbuild/tmp/build/20181104T163428Z/ruby/lib/rubygems/test_case.rb:511:in `block (2 levels) in install_gem'
    /data/chkbuild/tmp/build/20181104T163428Z/ruby/lib/rubygems/test_case.rb:510:in `chdir'
    /data/chkbuild/tmp/build/20181104T163428Z/ruby/lib/rubygems/test_case.rb:510:in `block in install_gem'
    /data/chkbuild/tmp/build/20181104T163428Z/ruby/lib/rubygems/user_interaction.rb:46:in `use_ui'
    /data/chkbuild/tmp/build/20181104T163428Z/ruby/lib/rubygems/user_interaction.rb:69:in `use_ui'
    /data/chkbuild/tmp/build/20181104T163428Z/ruby/lib/rubygems/test_case.rb:509:in `install_gem'
    /data/chkbuild/tmp/build/20181104T163428Z/ruby/test/rdoc/test_rdoc_rubygems_hook.rb:22:in `setup'

  9) Error:
TestRDocRubygemsHook#test_remove_unwritable:
RuntimeError: no  in [#<Digest::SHA512: aacdafc5652a76014c2f179f44a5092cb4b7dcc7e54e1367bf2dc70492f9d12e7e90874c729b13e42000400d743686b7b87db76eaaf9b37d3031565f2e355ce8>]
    /data/chkbuild/tmp/build/20181104T163428Z/ruby/lib/rubygems/package/tar_writer.rb:199:in `add_file_signed'
    /data/chkbuild/tmp/build/20181104T163428Z/ruby/lib/rubygems/package.rb:231:in `add_metadata'
    /data/chkbuild/tmp/build/20181104T163428Z/ruby/lib/rubygems/package.rb:254:in `block (2 levels) in build'
    /data/chkbuild/tmp/build/20181104T163428Z/ruby/lib/rubygems/package/tar_writer.rb:86:in `new'
    /data/chkbuild/tmp/build/20181104T163428Z/ruby/lib/rubygems/package.rb:253:in `block in build'
    /data/chkbuild/tmp/build/20181104T163428Z/ruby/lib/rubygems/package/file_source.rb:26:in `open'
    /data/chkbuild/tmp/build/20181104T163428Z/ruby/lib/rubygems/package/file_source.rb:26:in `with_write_io'
    /data/chkbuild/tmp/build/20181104T163428Z/ruby/lib/rubygems/package.rb:252:in `build'
    /data/chkbuild/tmp/build/20181104T163428Z/ruby/lib/rubygems/package.rb:115:in `build'
    /data/chkbuild/tmp/build/20181104T163428Z/ruby/lib/rubygems/test_case.rb:511:in `block (2 levels) in install_gem'
    /data/chkbuild/tmp/build/20181104T163428Z/ruby/lib/rubygems/test_case.rb:510:in `chdir'
    /data/chkbuild/tmp/build/20181104T163428Z/ruby/lib/rubygems/test_case.rb:510:in `block in install_gem'
    /data/chkbuild/tmp/build/20181104T163428Z/ruby/lib/rubygems/user_interaction.rb:46:in `use_ui'
    /data/chkbuild/tmp/build/20181104T163428Z/ruby/lib/rubygems/user_interaction.rb:69:in `use_ui'
    /data/chkbuild/tmp/build/20181104T163428Z/ruby/lib/rubygems/test_case.rb:509:in `install_gem'
    /data/chkbuild/tmp/build/20181104T163428Z/ruby/test/rdoc/test_rdoc_rubygems_hook.rb:22:in `setup'

 10) Error:
TestRDocRubygemsHook#test_rdoc_installed?:
RuntimeError: no  in [#<Digest::SHA512: aacdafc5652a76014c2f179f44a5092cb4b7dcc7e54e1367bf2dc70492f9d12e7e90874c729b13e42000400d743686b7b87db76eaaf9b37d3031565f2e355ce8>]
    /data/chkbuild/tmp/build/20181104T163428Z/ruby/lib/rubygems/package/tar_writer.rb:199:in `add_file_signed'
    /data/chkbuild/tmp/build/20181104T163428Z/ruby/lib/rubygems/package.rb:231:in `add_metadata'
    /data/chkbuild/tmp/build/20181104T163428Z/ruby/lib/rubygems/package.rb:254:in `block (2 levels) in build'
    /data/chkbuild/tmp/build/20181104T163428Z/ruby/lib/rubygems/package/tar_writer.rb:86:in `new'
    /data/chkbuild/tmp/build/20181104T163428Z/ruby/lib/rubygems/package.rb:253:in `block in build'
    /data/chkbuild/tmp/build/20181104T163428Z/ruby/lib/rubygems/package/file_source.rb:26:in `open'
    /data/chkbuild/tmp/build/20181104T163428Z/ruby/lib/rubygems/package/file_source.rb:26:in `with_write_io'
    /data/chkbuild/tmp/build/20181104T163428Z/ruby/lib/rubygems/package.rb:252:in `build'
    /data/chkbuild/tmp/build/20181104T163428Z/ruby/lib/rubygems/package.rb:115:in `build'
    /data/chkbuild/tmp/build/20181104T163428Z/ruby/lib/rubygems/test_case.rb:511:in `block (2 levels) in install_gem'
    /data/chkbuild/tmp/build/20181104T163428Z/ruby/lib/rubygems/test_case.rb:510:in `chdir'
    /data/chkbuild/tmp/build/20181104T163428Z/ruby/lib/rubygems/test_case.rb:510:in `block in install_gem'
    /data/chkbuild/tmp/build/20181104T163428Z/ruby/lib/rubygems/user_interaction.rb:46:in `use_ui'
    /data/chkbuild/tmp/build/20181104T163428Z/ruby/lib/rubygems/user_interaction.rb:69:in `use_ui'
    /data/chkbuild/tmp/build/20181104T163428Z/ruby/lib/rubygems/test_case.rb:509:in `install_gem'
    /data/chkbuild/tmp/build/20181104T163428Z/ruby/test/rdoc/test_rdoc_rubygems_hook.rb:22:in `setup'

 11) Error:
TestRDocRubygemsHook#test_new_rdoc:
RuntimeError: no  in [#<Digest::SHA512: aacdafc5652a76014c2f179f44a5092cb4b7dcc7e54e1367bf2dc70492f9d12e7e90874c729b13e42000400d743686b7b87db76eaaf9b37d3031565f2e355ce8>]
    /data/chkbuild/tmp/build/20181104T163428Z/ruby/lib/rubygems/package/tar_writer.rb:199:in `add_file_signed'
    /data/chkbuild/tmp/build/20181104T163428Z/ruby/lib/rubygems/package.rb:231:in `add_metadata'
    /data/chkbuild/tmp/build/20181104T163428Z/ruby/lib/rubygems/package.rb:254:in `block (2 levels) in build'
    /data/chkbuild/tmp/build/20181104T163428Z/ruby/lib/rubygems/package/tar_writer.rb:86:in `new'
    /data/chkbuild/tmp/build/20181104T163428Z/ruby/lib/rubygems/package.rb:253:in `block in build'
    /data/chkbuild/tmp/build/20181104T163428Z/ruby/lib/rubygems/package/file_source.rb:26:in `open'
    /data/chkbuild/tmp/build/20181104T163428Z/ruby/lib/rubygems/package/file_source.rb:26:in `with_write_io'
    /data/chkbuild/tmp/build/20181104T163428Z/ruby/lib/rubygems/package.rb:252:in `build'
    /data/chkbuild/tmp/build/20181104T163428Z/ruby/lib/rubygems/package.rb:115:in `build'
    /data/chkbuild/tmp/build/20181104T163428Z/ruby/lib/rubygems/test_case.rb:511:in `block (2 levels) in install_gem'
    /data/chkbuild/tmp/build/20181104T163428Z/ruby/lib/rubygems/test_case.rb:510:in `chdir'
    /data/chkbuild/tmp/build/20181104T163428Z/ruby/lib/rubygems/test_case.rb:510:in `block in install_gem'
    /data/chkbuild/tmp/build/20181104T163428Z/ruby/lib/rubygems/user_interaction.rb:46:in `use_ui'
    /data/chkbuild/tmp/build/20181104T163428Z/ruby/lib/rubygems/user_interaction.rb:69:in `use_ui'
    /data/chkbuild/tmp/build/20181104T163428Z/ruby/lib/rubygems/test_case.rb:509:in `install_gem'
    /data/chkbuild/tmp/build/20181104T163428Z/ruby/test/rdoc/test_rdoc_rubygems_hook.rb:22:in `setup'

 12) Error:
TestRDocRubygemsHook#test_ri_installed?:
RuntimeError: no  in [#<Digest::SHA512: aacdafc5652a76014c2f179f44a5092cb4b7dcc7e54e1367bf2dc70492f9d12e7e90874c729b13e42000400d743686b7b87db76eaaf9b37d3031565f2e355ce8>]
    /data/chkbuild/tmp/build/20181104T163428Z/ruby/lib/rubygems/package/tar_writer.rb:199:in `add_file_signed'
    /data/chkbuild/tmp/build/20181104T163428Z/ruby/lib/rubygems/package.rb:231:in `add_metadata'
    /data/chkbuild/tmp/build/20181104T163428Z/ruby/lib/rubygems/package.rb:254:in `block (2 levels) in build'
    /data/chkbuild/tmp/build/20181104T163428Z/ruby/lib/rubygems/package/tar_writer.rb:86:in `new'
    /data/chkbuild/tmp/build/20181104T163428Z/ruby/lib/rubygems/package.rb:253:in `block in build'
    /data/chkbuild/tmp/build/20181104T163428Z/ruby/lib/rubygems/package/file_source.rb:26:in `open'
    /data/chkbuild/tmp/build/20181104T163428Z/ruby/lib/rubygems/package/file_source.rb:26:in `with_write_io'
    /data/chkbuild/tmp/build/20181104T163428Z/ruby/lib/rubygems/package.rb:252:in `build'
    /data/chkbuild/tmp/build/20181104T163428Z/ruby/lib/rubygems/package.rb:115:in `build'
    /data/chkbuild/tmp/build/20181104T163428Z/ruby/lib/rubygems/test_case.rb:511:in `block (2 levels) in install_gem'
    /data/chkbuild/tmp/build/20181104T163428Z/ruby/lib/rubygems/test_case.rb:510:in `chdir'
    /data/chkbuild/tmp/build/20181104T163428Z/ruby/lib/rubygems/test_case.rb:510:in `block in install_gem'
    /data/chkbuild/tmp/build/20181104T163428Z/ruby/lib/rubygems/user_interaction.rb:46:in `use_ui'
    /data/chkbuild/tmp/build/20181104T163428Z/ruby/lib/rubygems/user_interaction.rb:69:in `use_ui'
    /data/chkbuild/tmp/build/20181104T163428Z/ruby/lib/rubygems/test_case.rb:509:in `install_gem'
    /data/chkbuild/tmp/build/20181104T163428Z/ruby/test/rdoc/test_rdoc_rubygems_hook.rb:22:in `setup'

 13) Error:
TestRDocRubygemsHook#test_setup:
RuntimeError: no  in [#<Digest::SHA512: aacdafc5652a76014c2f179f44a5092cb4b7dcc7e54e1367bf2dc70492f9d12e7e90874c729b13e42000400d743686b7b87db76eaaf9b37d3031565f2e355ce8>]
    /data/chkbuild/tmp/build/20181104T163428Z/ruby/lib/rubygems/package/tar_writer.rb:199:in `add_file_signed'
    /data/chkbuild/tmp/build/20181104T163428Z/ruby/lib/rubygems/package.rb:231:in `add_metadata'
    /data/chkbuild/tmp/build/20181104T163428Z/ruby/lib/rubygems/package.rb:254:in `block (2 levels) in build'
    /data/chkbuild/tmp/build/20181104T163428Z/ruby/lib/rubygems/package/tar_writer.rb:86:in `new'
    /data/chkbuild/tmp/build/20181104T163428Z/ruby/lib/rubygems/package.rb:253:in `block in build'
    /data/chkbuild/tmp/build/20181104T163428Z/ruby/lib/rubygems/package/file_source.rb:26:in `open'
    /data/chkbuild/tmp/build/20181104T163428Z/ruby/lib/rubygems/package/file_source.rb:26:in `with_write_io'
    /data/chkbuild/tmp/build/20181104T163428Z/ruby/lib/rubygems/package.rb:252:in `build'
    /data/chkbuild/tmp/build/20181104T163428Z/ruby/lib/rubygems/package.rb:115:in `build'
    /data/chkbuild/tmp/build/20181104T163428Z/ruby/lib/rubygems/test_case.rb:511:in `block (2 levels) in install_gem'
    /data/chkbuild/tmp/build/20181104T163428Z/ruby/lib/rubygems/test_case.rb:510:in `chdir'
    /data/chkbuild/tmp/build/20181104T163428Z/ruby/lib/rubygems/test_case.rb:510:in `block in install_gem'
    /data/chkbuild/tmp/build/20181104T163428Z/ruby/lib/rubygems/user_interaction.rb:46:in `use_ui'
    /data/chkbuild/tmp/build/20181104T163428Z/ruby/lib/rubygems/user_interaction.rb:69:in `use_ui'
    /data/chkbuild/tmp/build/20181104T163428Z/ruby/lib/rubygems/test_case.rb:509:in `install_gem'
    /data/chkbuild/tmp/build/20181104T163428Z/ruby/test/rdoc/test_rdoc_rubygems_hook.rb:22:in `setup'

 14) Error:
TestRDocRubygemsHook#test_generate_all:
RuntimeError: no  in [#<Digest::SHA512: aacdafc5652a76014c2f179f44a5092cb4b7dcc7e54e1367bf2dc70492f9d12e7e90874c729b13e42000400d743686b7b87db76eaaf9b37d3031565f2e355ce8>]
    /data/chkbuild/tmp/build/20181104T163428Z/ruby/lib/rubygems/package/tar_writer.rb:199:in `add_file_signed'
    /data/chkbuild/tmp/build/20181104T163428Z/ruby/lib/rubygems/package.rb:231:in `add_metadata'
    /data/chkbuild/tmp/build/20181104T163428Z/ruby/lib/rubygems/package.rb:254:in `block (2 levels) in build'
    /data/chkbuild/tmp/build/20181104T163428Z/ruby/lib/rubygems/package/tar_writer.rb:86:in `new'
    /data/chkbuild/tmp/build/20181104T163428Z/ruby/lib/rubygems/package.rb:253:in `block in build'
    /data/chkbuild/tmp/build/20181104T163428Z/ruby/lib/rubygems/package/file_source.rb:26:in `open'
    /data/chkbuild/tmp/build/20181104T163428Z/ruby/lib/rubygems/package/file_source.rb:26:in `with_write_io'
    /data/chkbuild/tmp/build/20181104T163428Z/ruby/lib/rubygems/package.rb:252:in `build'
    /data/chkbuild/tmp/build/20181104T163428Z/ruby/lib/rubygems/package.rb:115:in `build'
    /data/chkbuild/tmp/build/20181104T163428Z/ruby/lib/rubygems/test_case.rb:511:in `block (2 levels) in install_gem'
    /data/chkbuild/tmp/build/20181104T163428Z/ruby/lib/rubygems/test_case.rb:510:in `chdir'
    /data/chkbuild/tmp/build/20181104T163428Z/ruby/lib/rubygems/test_case.rb:510:in `block in install_gem'
    /data/chkbuild/tmp/build/20181104T163428Z/ruby/lib/rubygems/user_interaction.rb:46:in `use_ui'
    /data/chkbuild/tmp/build/20181104T163428Z/ruby/lib/rubygems/user_interaction.rb:69:in `use_ui'
    /data/chkbuild/tmp/build/20181104T163428Z/ruby/lib/rubygems/test_case.rb:509:in `install_gem'
    /data/chkbuild/tmp/build/20181104T163428Z/ruby/test/rdoc/test_rdoc_rubygems_hook.rb:22:in `setup'

 15) Error:
TestRDocRubygemsHook#test_generate_configuration_rdoc_string:
RuntimeError: no  in [#<Digest::SHA512: aacdafc5652a76014c2f179f44a5092cb4b7dcc7e54e1367bf2dc70492f9d12e7e90874c729b13e42000400d743686b7b87db76eaaf9b37d3031565f2e355ce8>]
    /data/chkbuild/tmp/build/20181104T163428Z/ruby/lib/rubygems/package/tar_writer.rb:199:in `add_file_signed'
    /data/chkbuild/tmp/build/20181104T163428Z/ruby/lib/rubygems/package.rb:231:in `add_metadata'
    /data/chkbuild/tmp/build/20181104T163428Z/ruby/lib/rubygems/package.rb:254:in `block (2 levels) in build'
    /data/chkbuild/tmp/build/20181104T163428Z/ruby/lib/rubygems/package/tar_writer.rb:86:in `new'
    /data/chkbuild/tmp/build/20181104T163428Z/ruby/lib/rubygems/package.rb:253:in `block in build'
    /data/chkbuild/tmp/build/20181104T163428Z/ruby/lib/rubygems/package/file_source.rb:26:in `open'
    /data/chkbuild/tmp/build/20181104T163428Z/ruby/lib/rubygems/package/file_source.rb:26:in `with_write_io'
    /data/chkbuild/tmp/build/20181104T163428Z/ruby/lib/rubygems/package.rb:252:in `build'
    /data/chkbuild/tmp/build/20181104T163428Z/ruby/lib/rubygems/package.rb:115:in `build'
    /data/chkbuild/tmp/build/20181104T163428Z/ruby/lib/rubygems/test_case.rb:511:in `block (2 levels) in install_gem'
    /data/chkbuild/tmp/build/20181104T163428Z/ruby/lib/rubygems/test_case.rb:510:in `chdir'
    /data/chkbuild/tmp/build/20181104T163428Z/ruby/lib/rubygems/test_case.rb:510:in `block in install_gem'
    /data/chkbuild/tmp/build/20181104T163428Z/ruby/lib/rubygems/user_interaction.rb:46:in `use_ui'
    /data/chkbuild/tmp/build/20181104T163428Z/ruby/lib/rubygems/user_interaction.rb:69:in `use_ui'
    /data/chkbuild/tmp/build/20181104T163428Z/ruby/lib/rubygems/test_case.rb:509:in `install_gem'
    /data/chkbuild/tmp/build/20181104T163428Z/ruby/test/rdoc/test_rdoc_rubygems_hook.rb:22:in `setup'

 16) Error:
TestRDocRubygemsHook#test_delete_legacy_args:
RuntimeError: no  in [#<Digest::SHA512: aacdafc5652a76014c2f179f44a5092cb4b7dcc7e54e1367bf2dc70492f9d12e7e90874c729b13e42000400d743686b7b87db76eaaf9b37d3031565f2e355ce8>]
    /data/chkbuild/tmp/build/20181104T163428Z/ruby/lib/rubygems/package/tar_writer.rb:199:in `add_file_signed'
    /data/chkbuild/tmp/build/20181104T163428Z/ruby/lib/rubygems/package.rb:231:in `add_metadata'
    /data/chkbuild/tmp/build/20181104T163428Z/ruby/lib/rubygems/package.rb:254:in `block (2 levels) in build'
    /data/chkbuild/tmp/build/20181104T163428Z/ruby/lib/rubygems/package/tar_writer.rb:86:in `new'
    /data/chkbuild/tmp/build/20181104T163428Z/ruby/lib/rubygems/package.rb:253:in `block in build'
    /data/chkbuild/tmp/build/20181104T163428Z/ruby/lib/rubygems/package/file_source.rb:26:in `open'
    /data/chkbuild/tmp/build/20181104T163428Z/ruby/lib/rubygems/package/file_source.rb:26:in `with_write_io'
    /data/chkbuild/tmp/build/20181104T163428Z/ruby/lib/rubygems/package.rb:252:in `build'
    /data/chkbuild/tmp/build/20181104T163428Z/ruby/lib/rubygems/package.rb:115:in `build'
    /data/chkbuild/tmp/build/20181104T163428Z/ruby/lib/rubygems/test_case.rb:511:in `block (2 levels) in install_gem'
    /data/chkbuild/tmp/build/20181104T163428Z/ruby/lib/rubygems/test_case.rb:510:in `chdir'
    /data/chkbuild/tmp/build/20181104T163428Z/ruby/lib/rubygems/test_case.rb:510:in `block in install_gem'
    /data/chkbuild/tmp/build/20181104T163428Z/ruby/lib/rubygems/user_interaction.rb:46:in `use_ui'
    /data/chkbuild/tmp/build/20181104T163428Z/ruby/lib/rubygems/user_interaction.rb:69:in `use_ui'
    /data/chkbuild/tmp/build/20181104T163428Z/ruby/lib/rubygems/test_case.rb:509:in `install_gem'
    /data/chkbuild/tmp/build/20181104T163428Z/ruby/test/rdoc/test_rdoc_rubygems_hook.rb:22:in `setup'

 17) Error:
TestRDocRubygemsHook#test_document:
RuntimeError: no  in [#<Digest::SHA512: aacdafc5652a76014c2f179f44a5092cb4b7dcc7e54e1367bf2dc70492f9d12e7e90874c729b13e42000400d743686b7b87db76eaaf9b37d3031565f2e355ce8>]
    /data/chkbuild/tmp/build/20181104T163428Z/ruby/lib/rubygems/package/tar_writer.rb:199:in `add_file_signed'
    /data/chkbuild/tmp/build/20181104T163428Z/ruby/lib/rubygems/package.rb:231:in `add_metadata'
    /data/chkbuild/tmp/build/20181104T163428Z/ruby/lib/rubygems/package.rb:254:in `block (2 levels) in build'
    /data/chkbuild/tmp/build/20181104T163428Z/ruby/lib/rubygems/package/tar_writer.rb:86:in `new'
    /data/chkbuild/tmp/build/20181104T163428Z/ruby/lib/rubygems/package.rb:253:in `block in build'
    /data/chkbuild/tmp/build/20181104T163428Z/ruby/lib/rubygems/package/file_source.rb:26:in `open'
    /data/chkbuild/tmp/build/20181104T163428Z/ruby/lib/rubygems/package/file_source.rb:26:in `with_write_io'
    /data/chkbuild/tmp/build/20181104T163428Z/ruby/lib/rubygems/package.rb:252:in `build'
    /data/chkbuild/tmp/build/20181104T163428Z/ruby/lib/rubygems/package.rb:115:in `build'
    /data/chkbuild/tmp/build/20181104T163428Z/ruby/lib/rubygems/test_case.rb:511:in `block (2 levels) in install_gem'
    /data/chkbuild/tmp/build/20181104T163428Z/ruby/lib/rubygems/test_case.rb:510:in `chdir'
    /data/chkbuild/tmp/build/20181104T163428Z/ruby/lib/rubygems/test_case.rb:510:in `block in install_gem'
    /data/chkbuild/tmp/build/20181104T163428Z/ruby/lib/rubygems/user_interaction.rb:46:in `use_ui'
    /data/chkbuild/tmp/build/20181104T163428Z/ruby/lib/rubygems/user_interaction.rb:69:in `use_ui'
    /data/chkbuild/tmp/build/20181104T163428Z/ruby/lib/rubygems/test_case.rb:509:in `install_gem'
    /data/chkbuild/tmp/build/20181104T163428Z/ruby/test/rdoc/test_rdoc_rubygems_hook.rb:22:in `setup'

 18) Error:
TestRDocRubygemsHook#test_generate_configuration_rdoc_array:
RuntimeError: no  in [#<Digest::SHA512: aacdafc5652a76014c2f179f44a5092cb4b7dcc7e54e1367bf2dc70492f9d12e7e90874c729b13e42000400d743686b7b87db76eaaf9b37d3031565f2e355ce8>]
    /data/chkbuild/tmp/build/20181104T163428Z/ruby/lib/rubygems/package/tar_writer.rb:199:in `add_file_signed'
    /data/chkbuild/tmp/build/20181104T163428Z/ruby/lib/rubygems/package.rb:231:in `add_metadata'
    /data/chkbuild/tmp/build/20181104T163428Z/ruby/lib/rubygems/package.rb:254:in `block (2 levels) in build'
    /data/chkbuild/tmp/build/20181104T163428Z/ruby/lib/rubygems/package/tar_writer.rb:86:in `new'
    /data/chkbuild/tmp/build/20181104T163428Z/ruby/lib/rubygems/package.rb:253:in `block in build'
    /data/chkbuild/tmp/build/20181104T163428Z/ruby/lib/rubygems/package/file_source.rb:26:in `open'
    /data/chkbuild/tmp/build/20181104T163428Z/ruby/lib/rubygems/package/file_source.rb:26:in `with_write_io'
    /data/chkbuild/tmp/build/20181104T163428Z/ruby/lib/rubygems/package.rb:252:in `build'
    /data/chkbuild/tmp/build/20181104T163428Z/ruby/lib/rubygems/package.rb:115:in `build'
    /data/chkbuild/tmp/build/20181104T163428Z/ruby/lib/rubygems/test_case.rb:511:in `block (2 levels) in install_gem'
    /data/chkbuild/tmp/build/20181104T163428Z/ruby/lib/rubygems/test_case.rb:510:in `chdir'
    /data/chkbuild/tmp/build/20181104T163428Z/ruby/lib/rubygems/test_case.rb:510:in `block in install_gem'
    /data/chkbuild/tmp/build/20181104T163428Z/ruby/lib/rubygems/user_interaction.rb:46:in `use_ui'
    /data/chkbuild/tmp/build/20181104T163428Z/ruby/lib/rubygems/user_interaction.rb:69:in `use_ui'
    /data/chkbuild/tmp/build/20181104T163428Z/ruby/lib/rubygems/test_case.rb:509:in `install_gem'
    /data/chkbuild/tmp/build/20181104T163428Z/ruby/test/rdoc/test_rdoc_rubygems_hook.rb:22:in `setup'

2131 tests, 5031 assertions, 0 failures, 18 errors, 1 skips

ruby -v: ruby 2.3.8p459 (2018-10-18 revision 65135) [x86_64-linux]
make: *** [uncommon.mk:605: yes-test-all] Error 18
exit 2
failed(test/rdoc)
== test/ruby # 2018-11-04T16:43:39+00:00 (full)
...(snip 4866 lines)...
TestWeakMap#test_size = 0.00 s = .
TestWhileuntil#test_until = 0.00 s = .
TestWhileuntil#test_while = 0.00 s = .
TestWindows1251#test_windows_1251 = 0.01 s = .
TestWindows1252#test_stset = 0.00 s = .
TestWindows1252#test_windows_1252 = 0.01 s = .


Finished tests in 144.392918s, 32.5639 tests/s, 13148.6435 assertions/s.

  1) Failure:
TestExtLibs#test_existence_of_openssl [/data/chkbuild/tmp/build/20181104T163428Z/ruby/test/ruby/test_extlibs.rb:20]:
extension library `openssl' is not found.  this may be false positive, but should assert because rubygems requires this
=== OpenSSL for Ruby configurator ===
=== Checking for system dependent stuff... ===
have_library: checking for t_open() in -lnsl... -------------------- no

"gcc -o conftest -I../../.ext/include/x86_64-linux -I../.././include -I../.././ext/openssl -DRUBY_DEBUG_ENV    -O3 -fno-fast-math -ggdb3 -Wall -Wextra -Wno-unused-parameter -Wno-parentheses -Wno-long-long -Wno-missing-field-initializers -Wunused-variable -Wpointer-arith -Wwrite-strings -Wdeclaration-after-statement -Wimplicit-function-declaration -Wdeprecated-declarations -Wno-packed-bitfield-compat conftest.c  -L. -L../.. -L. -fstack-protector -rdynamic -Wl,-export-dynamic     -Wl,-rpath,/data/chkbuild/tmp/build/20181104T163428Z/lib -L/data/chkbuild/tmp/build/20181104T163428Z/lib -lruby-static -lnsl  -lpthread -ldl -lcrypt -lm   -lc"
conftest.c: In function ‘t’:
conftest.c:13:57: error: ‘t_open’ undeclared (first use in this function); did you mean ‘popen’?
 int t(void) { void ((*volatile p)()); p = (void ((*)()))t_open; return !p; }
                                                         ^~~~~~
                                                         popen
conftest.c:13:57: note: each undeclared identifier is reported only once for each function it appears in
checked program was:
/* begin */
 1: #include "ruby.h"
 2: 
 3: /*top*/
 4: extern int t(void);
 5: int main(int argc, char **argv)
 6: {
 7:   if (argc > 1000000) {
 8:     printf("%p", &t);
 9:   }
10: 
11:   return 0;
12: }
13: int t(void) { void ((*volatile p)()); p = (void ((*)()))t_open; return !p; }
/* end */

"gcc -o conftest -I../../.ext/include/x86_64-linux -I../.././include -I../.././ext/openssl -DRUBY_DEBUG_ENV    -O3 -fno-fast-math -ggdb3 -Wall -Wextra -Wno-unused-parameter -Wno-parentheses -Wno-long-long -Wno-missing-field-initializers -Wunused-variable -Wpointer-arith -Wwrite-strings -Wdeclaration-after-statement -Wimplicit-function-declaration -Wdeprecated-declarations -Wno-packed-bitfield-compat conftest.c  -L. -L../.. -L. -fstack-protector -rdynamic -Wl,-export-dynamic     -Wl,-rpath,/data/chkbuild/tmp/build/20181104T163428Z/lib -L/data/chkbuild/tmp/build/20181104T163428Z/lib -lruby-static -lnsl  -lpthread -ldl -lcrypt -lm   -lc"
/usr/bin/ld: /data/chkbuild/tmp/build/20181104T163428Z/tmp/ccyIN9Sb.o: in function `t':
/data/chkbuild/tmp/build/20181104T163428Z/ruby/ext/openssl/conftest.c:14: undefined reference to `t_open'
collect2: error: ld returned 1 exit status
checked program was:
/* begin */
 1: #include "ruby.h"
 2: 
 3: /*top*/
 4: extern int t(void);
 5: int main(int argc, char **argv)
 6: {
 7:   if (argc > 1000000) {
 8:     printf("%p", &t);
 9:   }
10: 
11:   return 0;
12: }
13: extern void t_open();
14: int t(void) { t_open(); return 0; }
/* end */

--------------------

have_library: checking for socket() in -lsocket... -------------------- no

"gcc -o conftest -I../../.ext/include/x86_64-linux -I../.././include -I../.././ext/openssl -DRUBY_DEBUG_ENV    -O3 -fno-fast-math -ggdb3 -Wall -Wextra -Wno-unused-parameter -Wno-parentheses -Wno-long-long -Wno-missing-field-initializers -Wunused-variable -Wpointer-arith -Wwrite-strings -Wdeclaration-after-statement -Wimplicit-function-declaration -Wdeprecated-declarations -Wno-packed-bitfield-compat conftest.c  -L. -L../.. -L. -fstack-protector -rdynamic -Wl,-export-dynamic     -Wl,-rpath,/data/chkbuild/tmp/build/20181104T163428Z/lib -L/data/chkbuild/tmp/build/20181104T163428Z/lib -lruby-static -lsocket  -lpthread -ldl -lcrypt -lm   -lc"
conftest.c: In function ‘t’:
conftest.c:13:57: error: ‘socket’ undeclared (first use in this function); did you mean ‘lockf’?
 int t(void) { void ((*volatile p)()); p = (void ((*)()))socket; return !p; }
                                                         ^~~~~~
                                                         lockf
conftest.c:13:57: note: each undeclared identifier is reported only once for each function it appears in
checked program was:
/* begin */
 1: #include "ruby.h"
 2: 
 3: /*top*/
 4: extern int t(void);
 5: int main(int argc, char **argv)
 6: {
 7:   if (argc > 1000000) {
 8:     printf("%p", &t);
 9:   }
10: 
11:   return 0;
12: }
13: int t(void) { void ((*volatile p)()); p = (void ((*)()))socket; return !p; }
/* end */

"gcc -o conftest -I../../.ext/include/x86_64-linux -I../.././include -I../.././ext/openssl -DRUBY_DEBUG_ENV    -O3 -fno-fast-math -ggdb3 -Wall -Wextra -Wno-unused-parameter -Wno-parentheses -Wno-long-long -Wno-missing-field-initializers -Wunused-variable -Wpointer-arith -Wwrite-strings -Wdeclaration-after-statement -Wimplicit-function-declaration -Wdeprecated-declarations -Wno-packed-bitfield-compat conftest.c  -L. -L../.. -L. -fstack-protector -rdynamic -Wl,-export-dynamic     -Wl,-rpath,/data/chkbuild/tmp/build/20181104T163428Z/lib -L/data/chkbuild/tmp/build/20181104T163428Z/lib -lruby-static -lsocket  -lpthread -ldl -lcrypt -lm   -lc"
/usr/bin/ld: cannot find -lsocket
collect2: error: ld returned 1 exit status
checked program was:
/* begin */
 1: #include "ruby.h"
 2: 
 3: /*top*/
 4: extern int t(void);
 5: int main(int argc, char **argv)
 6: {
 7:   if (argc > 1000000) {
 8:     printf("%p", &t);
 9:   }
10: 
11:   return 0;
12: }
13: extern void socket();
14: int t(void) { socket(); return 0; }
/* end */

--------------------

have_header: checking for assert.h... -------------------- yes

"gcc -E -I../../.ext/include/x86_64-linux -I../.././include -I../.././ext/openssl -DRUBY_DEBUG_ENV    -O3 -fno-fast-math -ggdb3 -Wall -Wextra -Wno-unused-parameter -Wno-parentheses -Wno-long-long -Wno-missing-field-initializers -Wunused-variable -Wpointer-arith -Wwrite-strings -Wdeclaration-after-statement -Wimplicit-function-declaration -Wdeprecated-declarations -Wno-packed-bitfield-compat  conftest.c -o conftest.i"
checked program was:
/* begin */
1: #include "ruby.h"
2: 
3: #include <assert.h>
/* end */

--------------------

=== Checking for required stuff... ===
package configuration for openssl is not found
have_header: checking for openssl/ssl.h... -------------------- yes

"gcc -E -I../../.ext/include/x86_64-linux -I../.././include -I../.././ext/openssl -DRUBY_DEBUG_ENV    -O3 -fno-fast-math -ggdb3 -Wall -Wextra -Wno-unused-parameter -Wno-parentheses -Wno-long-long -Wno-missing-field-initializers -Wunused-variable -Wpointer-arith -Wwrite-strings -Wdeclaration-after-statement -Wimplicit-function-declaration -Wdeprecated-declarations -Wno-packed-bitfield-compat  conftest.c -o conftest.i"
checked program was:
/* begin */
1: #include "ruby.h"
2: 
3: #include <openssl/ssl.h>
/* end */

--------------------

have_library: checking for OpenSSL_add_all_digests() in -lcrypto... -------------------- no

"gcc -o conftest -I../../.ext/include/x86_64-linux -I../.././include -I../.././ext/openssl -DRUBY_DEBUG_ENV    -O3 -fno-fast-math -ggdb3 -Wall -Wextra -Wno-unused-parameter -Wno-parentheses -Wno-long-long -Wno-missing-field-initializers -Wunused-variable -Wpointer-arith -Wwrite-strings -Wdeclaration-after-statement -Wimplicit-function-declaration -Wdeprecated-declarations -Wno-packed-bitfield-compat conftest.c  -L. -L../.. -L. -fstack-protector -rdynamic -Wl,-export-dynamic     -Wl,-rpath,/data/chkbuild/tmp/build/20181104T163428Z/lib -L/data/chkbuild/tmp/build/20181104T163428Z/lib -lruby-static -lcrypto  -lpthread -ldl -lcrypt -lm   -lc"
conftest.c: In function ‘t’:
conftest.c:13:57: error: ‘OpenSSL_add_all_digests’ undeclared (first use in this function)
 int t(void) { void ((*volatile p)()); p = (void ((*)()))OpenSSL_add_all_digests; return !p; }
                                                         ^~~~~~~~~~~~~~~~~~~~~~~
conftest.c:13:57: note: each undeclared identifier is reported only once for each function it appears in
checked program was:
/* begin */
 1: #include "ruby.h"
 2: 
 3: /*top*/
 4: extern int t(void);
 5: int main(int argc, char **argv)
 6: {
 7:   if (argc > 1000000) {
 8:     printf("%p", &t);
 9:   }
10: 
11:   return 0;
12: }
13: int t(void) { void ((*volatile p)()); p = (void ((*)()))OpenSSL_add_all_digests; return !p; }
/* end */

"gcc -o conftest -I../../.ext/include/x86_64-linux -I../.././include -I../.././ext/openssl -DRUBY_DEBUG_ENV    -O3 -fno-fast-math -ggdb3 -Wall -Wextra -Wno-unused-parameter -Wno-parentheses -Wno-long-long -Wno-missing-field-initializers -Wunused-variable -Wpointer-arith -Wwrite-strings -Wdeclaration-after-statement -Wimplicit-function-declaration -Wdeprecated-declarations -Wno-packed-bitfield-compat conftest.c  -L. -L../.. -L. -fstack-protector -rdynamic -Wl,-export-dynamic     -Wl,-rpath,/data/chkbuild/tmp/build/20181104T163428Z/lib -L/data/chkbuild/tmp/build/20181104T163428Z/lib -lruby-static -lcrypto  -lpthread -ldl -lcrypt -lm   -lc"
/usr/bin/ld: /data/chkbuild/tmp/build/20181104T163428Z/tmp/cc3Z4RD5.o: in function `t':
/data/chkbuild/tmp/build/20181104T163428Z/ruby/ext/openssl/conftest.c:14: undefined reference to `OpenSSL_add_all_digests'
collect2: error: ld returned 1 exit status
checked program was:
/* begin */
 1: #include "ruby.h"
 2: 
 3: /*top*/
 4: extern int t(void);
 5: int main(int argc, char **argv)
 6: {
 7:   if (argc > 1000000) {
 8:     printf("%p", &t);
 9:   }
10: 
11:   return 0;
12: }
13: extern void OpenSSL_add_all_digests();
14: int t(void) { OpenSSL_add_all_digests(); return 0; }
/* end */

--------------------

have_library: checking for OpenSSL_add_all_digests() in -llibeay32... -------------------- no

"gcc -o conftest -I../../.ext/include/x86_64-linux -I../.././include -I../.././ext/openssl -DRUBY_DEBUG_ENV    -O3 -fno-fast-math -ggdb3 -Wall -Wextra -Wno-unused-parameter -Wno-parentheses -Wno-long-long -Wno-missing-field-initializers -Wunused-variable -Wpointer-arith -Wwrite-strings -Wdeclaration-after-statement -Wimplicit-function-declaration -Wdeprecated-declarations -Wno-packed-bitfield-compat conftest.c  -L. -L../.. -L. -fstack-protector -rdynamic -Wl,-export-dynamic     -Wl,-rpath,/data/chkbuild/tmp/build/20181104T163428Z/lib -L/data/chkbuild/tmp/build/20181104T163428Z/lib -lruby-static -llibeay32  -lpthread -ldl -lcrypt -lm   -lc"
conftest.c: In function ‘t’:
conftest.c:13:57: error: ‘OpenSSL_add_all_digests’ undeclared (first use in this function)
 int t(void) { void ((*volatile p)()); p = (void ((*)()))OpenSSL_add_all_digests; return !p; }
                                                         ^~~~~~~~~~~~~~~~~~~~~~~
conftest.c:13:57: note: each undeclared identifier is reported only once for each function it appears in
checked program was:
/* begin */
 1: #include "ruby.h"
 2: 
 3: /*top*/
 4: extern int t(void);
 5: int main(int argc, char **argv)
 6: {
 7:   if (argc > 1000000) {
 8:     printf("%p", &t);
 9:   }
10: 
11:   return 0;
12: }
13: int t(void) { void ((*volatile p)()); p = (void ((*)()))OpenSSL_add_all_digests; return !p; }
/* end */

"gcc -o conftest -I../../.ext/include/x86_64-linux -I../.././include -I../.././ext/openssl -DRUBY_DEBUG_ENV    -O3 -fno-fast-math -ggdb3 -Wall -Wextra -Wno-unused-parameter -Wno-parentheses -Wno-long-long -Wno-missing-field-initializers -Wunused-variable -Wpointer-arith -Wwrite-strings -Wdeclaration-after-statement -Wimplicit-function-declaration -Wdeprecated-declarations -Wno-packed-bitfield-compat conftest.c  -L. -L../.. -L. -fstack-protector -rdynamic -Wl,-export-dynamic     -Wl,-rpath,/data/chkbuild/tmp/build/20181104T163428Z/lib -L/data/chkbuild/tmp/build/20181104T163428Z/lib -lruby-static -llibeay32  -lpthread -ldl -lcrypt -lm   -lc"
/usr/bin/ld: cannot find -llibeay32
collect2: error: ld returned 1 exit status
checked program was:
/* begin */
 1: #include "ruby.h"
 2: 
 3: /*top*/
 4: extern int t(void);
 5: int main(int argc, char **argv)
 6: {
 7:   if (argc > 1000000) {
 8:     printf("%p", &t);
 9:   }
10: 
11:   return 0;
12: }
13: extern void OpenSSL_add_all_digests();
14: int t(void) { OpenSSL_add_all_digests(); return 0; }
/* end */

--------------------

=== Checking for required stuff failed. ===
Makefile wasn't created. Fix the errors above.
Failed to configure openssl. It will not be installed.
.
Exception raised:
<#<LoadError: cannot load such file -- openssl>>.

  2) Failure:
TestTimeTZ#test_gen_Pacific_Kiritimati_71 [/data/chkbuild/tmp/build/20181104T163428Z/ruby/test/ruby/test_time_tz.rb:265]:
TZ=Pacific/Kiritimati Time.utc(1995, 1, 1, 9, 59, 59).localtime.
<"1994-12-31 23:59:59 -1000"> expected but was
<"1995-01-01 23:59:59 +1400">.

  3) Failure:
TestTimeTZ#test_gen_Pacific_Kiritimati_89 [/data/chkbuild/tmp/build/20181104T163428Z/ruby/test/ruby/test_time_tz.rb:283]:
TZ=Pacific/Kiritimati Time.local(1994, 12, 31, 23, 59, 59).
<"1994-12-31 23:59:59 -1000"> expected but was
<"1995-01-01 23:59:59 +1400">.

  4) Failure:
TestTimeTZ#test_pacific_kiritimati [/data/chkbuild/tmp/build/20181104T163428Z/ruby/test/ruby/test_time_tz.rb:181]:
TZ=Pacific/Kiritimati Time.local(1994, 12, 31, 23, 59, 59).
<"1994-12-31 23:59:59 -1000"> expected but was
<"1995-01-01 23:59:59 +1400">.

4702 tests, 1898571 assertions, 4 failures, 0 errors, 5 skips

ruby -v: ruby 2.3.8p459 (2018-10-18 revision 65135) [x86_64-linux]
make: *** [uncommon.mk:605: yes-test-all] Error 4
exit 2
failed(test/ruby)
== test/rubygems # 2018-11-04T16:46:05+00:00 (full)
...(snip 26 lines)...
	from /data/chkbuild/tmp/build/20181104T163428Z/ruby/test/lib/test/unit.rb:827:in `non_options'
	from /data/chkbuild/tmp/build/20181104T163428Z/ruby/test/lib/test/unit.rb:64:in `process_args'
	from /data/chkbuild/tmp/build/20181104T163428Z/ruby/test/lib/test/unit.rb:130:in `process_args'
	from /data/chkbuild/tmp/build/20181104T163428Z/ruby/test/lib/test/unit.rb:972:in `process_args'
	from /data/chkbuild/tmp/build/20181104T163428Z/ruby/test/lib/test/unit.rb:977:in `run'
	from /data/chkbuild/tmp/build/20181104T163428Z/ruby/test/lib/test/unit.rb:984:in `run'
	from ./test/runner.rb:40:in `<main>'
make: *** [uncommon.mk:605: yes-test-all] Error 1
exit 2
failed(test/rubygems)
== rubyspec # 2018-11-04T16:46:53+00:00 (full)
...(snip 49340 lines)...
- UNIXServer.open by raising an exception when there is a NUL byte
- UNIXSocket.open by raising an exception when there is a NUL byte

/data/chkbuild/tmp/build/20181104T163428Z/rubyspec/security/cve_2018_8780_spec.rb                                             
CVE-2018-8780 is resisted by
- Dir.glob by raising an exception when there is a NUL byte
- Dir.entries by raising an exception when there is a NUL byte
- Dir.foreach by raising an exception when there is a NUL byte


1)
File::Stat#dev_major returns the major part of File::Stat#dev FAILED
Expected nil (NilClass) to be kind of Integer
/data/chkbuild/tmp/build/20181104T163428Z/rubyspec/core/file/stat/dev_major_spec.rb:14:in `block (3 levels) in <top (required)>'
/data/chkbuild/tmp/build/20181104T163428Z/rubyspec/core/file/stat/dev_major_spec.rb:3:in `<top (required)>'

2)
File::Stat#dev_minor returns the minor part of File::Stat#dev FAILED
Expected nil (NilClass) to be kind of Integer
/data/chkbuild/tmp/build/20181104T163428Z/rubyspec/core/file/stat/dev_minor_spec.rb:14:in `block (3 levels) in <top (required)>'
/data/chkbuild/tmp/build/20181104T163428Z/rubyspec/core/file/stat/dev_minor_spec.rb:3:in `<top (required)>'

3)
File::Stat#rdev_major returns the major part of File::Stat#rdev FAILED
Expected nil (NilClass) to be kind of Integer
/data/chkbuild/tmp/build/20181104T163428Z/rubyspec/core/file/stat/rdev_major_spec.rb:22:in `block (3 levels) in <top (required)>'
/data/chkbuild/tmp/build/20181104T163428Z/rubyspec/core/file/stat/rdev_major_spec.rb:3:in `<top (required)>'

4)
File::Stat#rdev_minor returns the minor part of File::Stat#rdev FAILED
Expected nil (NilClass) to be kind of Integer
/data/chkbuild/tmp/build/20181104T163428Z/rubyspec/core/file/stat/rdev_minor_spec.rb:22:in `block (3 levels) in <top (required)>'
/data/chkbuild/tmp/build/20181104T163428Z/rubyspec/core/file/stat/rdev_minor_spec.rb:3:in `<top (required)>'

5)
An exception occurred during: loading /data/chkbuild/tmp/build/20181104T163428Z/rubyspec/library/openssl/cipher_spec.rb ERROR
LoadError: cannot load such file -- openssl
/data/chkbuild/tmp/build/20181104T163428Z/lib/ruby/2.3.0/rubygems/core_ext/kernel_require.rb:55:in `require'
/data/chkbuild/tmp/build/20181104T163428Z/lib/ruby/2.3.0/rubygems/core_ext/kernel_require.rb:55:in `require'
/data/chkbuild/tmp/build/20181104T163428Z/rubyspec/library/openssl/cipher_spec.rb:3:in `<top (required)>'

6)
An exception occurred during: loading /data/chkbuild/tmp/build/20181104T163428Z/rubyspec/library/openssl/config/freeze_spec.rb ERROR
LoadError: cannot load such file -- openssl
/data/chkbuild/tmp/build/20181104T163428Z/lib/ruby/2.3.0/rubygems/core_ext/kernel_require.rb:55:in `require'
/data/chkbuild/tmp/build/20181104T163428Z/lib/ruby/2.3.0/rubygems/core_ext/kernel_require.rb:55:in `require'
/data/chkbuild/tmp/build/20181104T163428Z/rubyspec/library/openssl/config/freeze_spec.rb:4:in `<top (required)>'

7)
An exception occurred during: loading /data/chkbuild/tmp/build/20181104T163428Z/rubyspec/library/openssl/hmac/digest_spec.rb ERROR
LoadError: cannot load such file -- openssl
/data/chkbuild/tmp/build/20181104T163428Z/lib/ruby/2.3.0/rubygems/core_ext/kernel_require.rb:55:in `require'
/data/chkbuild/tmp/build/20181104T163428Z/lib/ruby/2.3.0/rubygems/core_ext/kernel_require.rb:55:in `require'
/data/chkbuild/tmp/build/20181104T163428Z/rubyspec/library/openssl/hmac/digest_spec.rb:3:in `<top (required)>'

8)
An exception occurred during: loading /data/chkbuild/tmp/build/20181104T163428Z/rubyspec/library/openssl/hmac/hexdigest_spec.rb ERROR
LoadError: cannot load such file -- openssl
/data/chkbuild/tmp/build/20181104T163428Z/lib/ruby/2.3.0/rubygems/core_ext/kernel_require.rb:55:in `require'
/data/chkbuild/tmp/build/20181104T163428Z/lib/ruby/2.3.0/rubygems/core_ext/kernel_require.rb:55:in `require'
/data/chkbuild/tmp/build/20181104T163428Z/rubyspec/library/openssl/hmac/hexdigest_spec.rb:3:in `<top (required)>'

9)
An exception occurred during: loading /data/chkbuild/tmp/build/20181104T163428Z/rubyspec/library/openssl/random/pseudo_bytes_spec.rb ERROR
LoadError: cannot load such file -- openssl
/data/chkbuild/tmp/build/20181104T163428Z/lib/ruby/2.3.0/rubygems/core_ext/kernel_require.rb:55:in `require'
/data/chkbuild/tmp/build/20181104T163428Z/lib/ruby/2.3.0/rubygems/core_ext/kernel_require.rb:55:in `require'
/data/chkbuild/tmp/build/20181104T163428Z/rubyspec/library/openssl/random/shared/random_bytes.rb:2:in `<top (required)>'
/data/chkbuild/tmp/build/20181104T163428Z/rubyspec/library/openssl/random/pseudo_bytes_spec.rb:2:in `require_relative'
/data/chkbuild/tmp/build/20181104T163428Z/rubyspec/library/openssl/random/pseudo_bytes_spec.rb:2:in `<top (required)>'

10)
An exception occurred during: loading /data/chkbuild/tmp/build/20181104T163428Z/rubyspec/library/openssl/random/random_bytes_spec.rb ERROR
LoadError: cannot load such file -- openssl
/data/chkbuild/tmp/build/20181104T163428Z/lib/ruby/2.3.0/rubygems/core_ext/kernel_require.rb:55:in `require'
/data/chkbuild/tmp/build/20181104T163428Z/lib/ruby/2.3.0/rubygems/core_ext/kernel_require.rb:55:in `require'
/data/chkbuild/tmp/build/20181104T163428Z/rubyspec/library/openssl/random/shared/random_bytes.rb:2:in `<top (required)>'
/data/chkbuild/tmp/build/20181104T163428Z/rubyspec/library/openssl/random/random_bytes_spec.rb:2:in `require_relative'
/data/chkbuild/tmp/build/20181104T163428Z/rubyspec/library/openssl/random/random_bytes_spec.rb:2:in `<top (required)>'

11)
An exception occurred during: loading /data/chkbuild/tmp/build/20181104T163428Z/rubyspec/library/openssl/x509/name/parse_spec.rb ERROR
LoadError: cannot load such file -- openssl
/data/chkbuild/tmp/build/20181104T163428Z/lib/ruby/2.3.0/rubygems/core_ext/kernel_require.rb:55:in `require'
/data/chkbuild/tmp/build/20181104T163428Z/lib/ruby/2.3.0/rubygems/core_ext/kernel_require.rb:55:in `require'
/data/chkbuild/tmp/build/20181104T163428Z/rubyspec/library/openssl/x509/name/parse_spec.rb:2:in `<top (required)>'

Finished in 84.673353 seconds

3711 files, 29642 examples, 101038 expectations, 4 failures, 7 errors, 0 tagged
exit 1
failed(rubyspec)

20181104T133514Z(failure) < OlderDiff < 20181104T163428Z(failure) > NewerDiff > 20181104T193318Z(failure)


chkbuild summary recent last