r65135 ruby 2.3.8p459 (2018-10-18) [x86_64-linux] [2.3] (ubuntu) 1024W failed(test-all) 4failed(test/) rubyspec:4F7E

chkbuild summary recent last

OlderDiff < 20181105T043431Z(failure) < ThisDiff > 20181105T073747Z(failure) > NewerDiff

===================================================================
+++ 20181105T073747Z
@@ 152 @@
 Gid:	1003	1003	1003	1003
 FDSize:	64
 Groups:	1003
+NStgid:	22468
+NSpid:	22468
+NSpgid:	22468
+NSsid:	13942
 VmPeak: <nnn> kB
 VmSize: <nnn> kB
 VmLck: <nnn> kB
 VmPin:	       0 kB
 VmHWM: <nnn> kB
 VmRSS: <nnn> kB
+RssAnon:	      64 kB
 RssFile:	     716 kB
 RssShmem:	       0 kB
 VmData: <nnn> kB
@@ 17981 @@
 
  <n>) Error:
 TestRDocRubygemsHook#test_new_rdoc:
+RuntimeError: no  in [#<Digest::SHA512: 9ae160b226ae07fe4cc1ad929dc0ac7def6025ce5ebed05ef76c766960c173cf99f500331bccf6500220fafed28804fc5ee1b83c92d6f285bf54925c89336375>]
     <build-dir>/ruby/lib/rubygems/package/tar_writer.rb:<line_a>:in `add_file_signed'
     <build-dir>/ruby/lib/rubygems/package.rb:<line_a>:in `add_metadata'
     <build-dir>/ruby/lib/rubygems/package.rb:<line_a>:in `block (2 levels) in build'
@@ 18001 @@
 
  <n>) Error:
 TestRDocRubygemsHook#test_generate_configuration_rdoc_string:
+RuntimeError: no  in [#<Digest::SHA512: 9ae160b226ae07fe4cc1ad929dc0ac7def6025ce5ebed05ef76c766960c173cf99f500331bccf6500220fafed28804fc5ee1b83c92d6f285bf54925c89336375>]
     <build-dir>/ruby/lib/rubygems/package/tar_writer.rb:<line_a>:in `add_file_signed'
     <build-dir>/ruby/lib/rubygems/package.rb:<line_a>:in `add_metadata'
     <build-dir>/ruby/lib/rubygems/package.rb:<line_a>:in `block (2 levels) in build'
@@ 18021 @@
 
  <n>) Error:
 TestRDocRubygemsHook#test_generate_all:
+RuntimeError: no  in [#<Digest::SHA512: 9ae160b226ae07fe4cc1ad929dc0ac7def6025ce5ebed05ef76c766960c173cf99f500331bccf6500220fafed28804fc5ee1b83c92d6f285bf54925c89336375>]
     <build-dir>/ruby/lib/rubygems/package/tar_writer.rb:<line_a>:in `add_file_signed'
     <build-dir>/ruby/lib/rubygems/package.rb:<line_a>:in `add_metadata'
     <build-dir>/ruby/lib/rubygems/package.rb:<line_a>:in `block (2 levels) in build'
@@ 18041 @@
 
  <n>) Error:
 TestRDocRubygemsHook#test_generate_force:
+RuntimeError: no  in [#<Digest::SHA512: 9ae160b226ae07fe4cc1ad929dc0ac7def6025ce5ebed05ef76c766960c173cf99f500331bccf6500220fafed28804fc5ee1b83c92d6f285bf54925c89336375>]
     <build-dir>/ruby/lib/rubygems/package/tar_writer.rb:<line_a>:in `add_file_signed'
     <build-dir>/ruby/lib/rubygems/package.rb:<line_a>:in `add_metadata'
     <build-dir>/ruby/lib/rubygems/package.rb:<line_a>:in `block (2 levels) in build'
@@ 18061 @@
 
  <n>) Error:
 TestRDocRubygemsHook#test_setup:
+RuntimeError: no  in [#<Digest::SHA512: 9ae160b226ae07fe4cc1ad929dc0ac7def6025ce5ebed05ef76c766960c173cf99f500331bccf6500220fafed28804fc5ee1b83c92d6f285bf54925c89336375>]
     <build-dir>/ruby/lib/rubygems/package/tar_writer.rb:<line_a>:in `add_file_signed'
     <build-dir>/ruby/lib/rubygems/package.rb:<line_a>:in `add_metadata'
     <build-dir>/ruby/lib/rubygems/package.rb:<line_a>:in `block (2 levels) in build'
@@ 18081 @@
 
  <n>) Error:
 TestRDocRubygemsHook#test_generate_configuration_rdoc_array:
+RuntimeError: no  in [#<Digest::SHA512: 9ae160b226ae07fe4cc1ad929dc0ac7def6025ce5ebed05ef76c766960c173cf99f500331bccf6500220fafed28804fc5ee1b83c92d6f285bf54925c89336375>]
     <build-dir>/ruby/lib/rubygems/package/tar_writer.rb:<line_a>:in `add_file_signed'
     <build-dir>/ruby/lib/rubygems/package.rb:<line_a>:in `add_metadata'
     <build-dir>/ruby/lib/rubygems/package.rb:<line_a>:in `block (2 levels) in build'
@@ 18101 @@
 
  <n>) Error:
 TestRDocRubygemsHook#test_setup_unwritable:
+RuntimeError: no  in [#<Digest::SHA512: 9ae160b226ae07fe4cc1ad929dc0ac7def6025ce5ebed05ef76c766960c173cf99f500331bccf6500220fafed28804fc5ee1b83c92d6f285bf54925c89336375>]
     <build-dir>/ruby/lib/rubygems/package/tar_writer.rb:<line_a>:in `add_file_signed'
     <build-dir>/ruby/lib/rubygems/package.rb:<line_a>:in `add_metadata'
     <build-dir>/ruby/lib/rubygems/package.rb:<line_a>:in `block (2 levels) in build'
@@ 18121 @@
 
  <n>) Error:
 TestRDocRubygemsHook#test_delete_legacy_args:
+RuntimeError: no  in [#<Digest::SHA512: 9ae160b226ae07fe4cc1ad929dc0ac7def6025ce5ebed05ef76c766960c173cf99f500331bccf6500220fafed28804fc5ee1b83c92d6f285bf54925c89336375>]
     <build-dir>/ruby/lib/rubygems/package/tar_writer.rb:<line_a>:in `add_file_signed'
     <build-dir>/ruby/lib/rubygems/package.rb:<line_a>:in `add_metadata'
     <build-dir>/ruby/lib/rubygems/package.rb:<line_a>:in `block (2 levels) in build'
@@ 18141 @@
 
  <n>) Error:
 TestRDocRubygemsHook#test_remove:
+RuntimeError: no  in [#<Digest::SHA512: 9ae160b226ae07fe4cc1ad929dc0ac7def6025ce5ebed05ef76c766960c173cf99f500331bccf6500220fafed28804fc5ee1b83c92d6f285bf54925c89336375>]
     <build-dir>/ruby/lib/rubygems/package/tar_writer.rb:<line_a>:in `add_file_signed'
     <build-dir>/ruby/lib/rubygems/package.rb:<line_a>:in `add_metadata'
     <build-dir>/ruby/lib/rubygems/package.rb:<line_a>:in `block (2 levels) in build'
@@ 18161 @@
 
  <n>) Error:
 TestRDocRubygemsHook#test_generate_disabled:
+RuntimeError: no  in [#<Digest::SHA512: 9ae160b226ae07fe4cc1ad929dc0ac7def6025ce5ebed05ef76c766960c173cf99f500331bccf6500220fafed28804fc5ee1b83c92d6f285bf54925c89336375>]
     <build-dir>/ruby/lib/rubygems/package/tar_writer.rb:<line_a>:in `add_file_signed'
     <build-dir>/ruby/lib/rubygems/package.rb:<line_a>:in `add_metadata'
     <build-dir>/ruby/lib/rubygems/package.rb:<line_a>:in `block (2 levels) in build'
@@ 18181 @@
 
  <n>) Error:
 TestRDocRubygemsHook#test_ri_installed?:
+RuntimeError: no  in [#<Digest::SHA512: 9ae160b226ae07fe4cc1ad929dc0ac7def6025ce5ebed05ef76c766960c173cf99f500331bccf6500220fafed28804fc5ee1b83c92d6f285bf54925c89336375>]
     <build-dir>/ruby/lib/rubygems/package/tar_writer.rb:<line_a>:in `add_file_signed'
     <build-dir>/ruby/lib/rubygems/package.rb:<line_a>:in `add_metadata'
     <build-dir>/ruby/lib/rubygems/package.rb:<line_a>:in `block (2 levels) in build'
@@ 18201 @@
 
  <n>) Error:
 TestRDocRubygemsHook#test_generate_default_gem:
+RuntimeError: no  in [#<Digest::SHA512: 9ae160b226ae07fe4cc1ad929dc0ac7def6025ce5ebed05ef76c766960c173cf99f500331bccf6500220fafed28804fc5ee1b83c92d6f285bf54925c89336375>]
     <build-dir>/ruby/lib/rubygems/package/tar_writer.rb:<line_a>:in `add_file_signed'
     <build-dir>/ruby/lib/rubygems/package.rb:<line_a>:in `add_metadata'
     <build-dir>/ruby/lib/rubygems/package.rb:<line_a>:in `block (2 levels) in build'
@@ 18221 @@
 
  <n>) Error:
 TestRDocRubygemsHook#test_document:
+RuntimeError: no  in [#<Digest::SHA512: 9ae160b226ae07fe4cc1ad929dc0ac7def6025ce5ebed05ef76c766960c173cf99f500331bccf6500220fafed28804fc5ee1b83c92d6f285bf54925c89336375>]
     <build-dir>/ruby/lib/rubygems/package/tar_writer.rb:<line_a>:in `add_file_signed'
     <build-dir>/ruby/lib/rubygems/package.rb:<line_a>:in `add_metadata'
     <build-dir>/ruby/lib/rubygems/package.rb:<line_a>:in `block (2 levels) in build'
@@ 18241 @@
 
  <n>) Error:
 TestRDocRubygemsHook#test_generate:
+RuntimeError: no  in [#<Digest::SHA512: 9ae160b226ae07fe4cc1ad929dc0ac7def6025ce5ebed05ef76c766960c173cf99f500331bccf6500220fafed28804fc5ee1b83c92d6f285bf54925c89336375>]
     <build-dir>/ruby/lib/rubygems/package/tar_writer.rb:<line_a>:in `add_file_signed'
     <build-dir>/ruby/lib/rubygems/package.rb:<line_a>:in `add_metadata'
     <build-dir>/ruby/lib/rubygems/package.rb:<line_a>:in `block (2 levels) in build'
@@ 18261 @@
 
  <n>) Error:
 TestRDocRubygemsHook#test_generate_no_overwrite:
+RuntimeError: no  in [#<Digest::SHA512: 9ae160b226ae07fe4cc1ad929dc0ac7def6025ce5ebed05ef76c766960c173cf99f500331bccf6500220fafed28804fc5ee1b83c92d6f285bf54925c89336375>]
     <build-dir>/ruby/lib/rubygems/package/tar_writer.rb:<line_a>:in `add_file_signed'
     <build-dir>/ruby/lib/rubygems/package.rb:<line_a>:in `add_metadata'
     <build-dir>/ruby/lib/rubygems/package.rb:<line_a>:in `block (2 levels) in build'
@@ 18281 @@
 
  <n>) Error:
 TestRDocRubygemsHook#test_remove_unwritable:
+RuntimeError: no  in [#<Digest::SHA512: 9ae160b226ae07fe4cc1ad929dc0ac7def6025ce5ebed05ef76c766960c173cf99f500331bccf6500220fafed28804fc5ee1b83c92d6f285bf54925c89336375>]
     <build-dir>/ruby/lib/rubygems/package/tar_writer.rb:<line_a>:in `add_file_signed'
     <build-dir>/ruby/lib/rubygems/package.rb:<line_a>:in `add_metadata'
     <build-dir>/ruby/lib/rubygems/package.rb:<line_a>:in `block (2 levels) in build'
@@ 18301 @@
 
  <n>) Error:
 TestRDocRubygemsHook#test_initialize:
+RuntimeError: no  in [#<Digest::SHA512: 9ae160b226ae07fe4cc1ad929dc0ac7def6025ce5ebed05ef76c766960c173cf99f500331bccf6500220fafed28804fc5ee1b83c92d6f285bf54925c89336375>]
     <build-dir>/ruby/lib/rubygems/package/tar_writer.rb:<line_a>:in `add_file_signed'
     <build-dir>/ruby/lib/rubygems/package.rb:<line_a>:in `add_metadata'
     <build-dir>/ruby/lib/rubygems/package.rb:<line_a>:in `block (2 levels) in build'
@@ 18321 @@
 
  <n>) Error:
 TestRDocRubygemsHook#test_rdoc_installed?:
+RuntimeError: no  in [#<Digest::SHA512: 9ae160b226ae07fe4cc1ad929dc0ac7def6025ce5ebed05ef76c766960c173cf99f500331bccf6500220fafed28804fc5ee1b83c92d6f285bf54925c89336375>]
     <build-dir>/ruby/lib/rubygems/package/tar_writer.rb:<line_a>:in `add_file_signed'
     <build-dir>/ruby/lib/rubygems/package.rb:<line_a>:in `add_metadata'
     <build-dir>/ruby/lib/rubygems/package.rb:<line_a>:in `block (2 levels) in build'
@@ 24535 @@
 /* end */
 
 "gcc -o conftest -I../../.ext/include/x86_64-linux -I../.././include -I../.././ext/openssl -DRUBY_DEBUG_ENV    -O3 -fno-fast-math -ggdb3 -Wall -Wextra -Wno-unused-parameter -Wno-parentheses -Wno-long-long -Wno-missing-field-initializers -Wunused-variable -Wpointer-arith -Wwrite-strings -Wdeclaration-after-statement -Wimplicit-function-declaration -Wdeprecated-declarations -Wno-packed-bitfield-compat conftest.c  -L. -L../.. -L. -fstack-protector -rdynamic -Wl,-export-dynamic     -Wl,-rpath,<build-dir>/lib -L<build-dir>/lib -lruby-static -lnsl  -lpthread -ldl -lcrypt -lm   -lc"
+/usr/bin/ld: <build-dir>/tmp/cccSynzY.o: in function `t':
 <build-dir>/ruby/ext/openssl/conftest.c:14: undefined reference to `t_open'
 collect2: error: ld returned 1 exit status
 checked program was:
@@ 24659 @@
 /* end */
 
 "gcc -o conftest -I../../.ext/include/x86_64-linux -I../.././include -I../.././ext/openssl -DRUBY_DEBUG_ENV    -O3 -fno-fast-math -ggdb3 -Wall -Wextra -Wno-unused-parameter -Wno-parentheses -Wno-long-long -Wno-missing-field-initializers -Wunused-variable -Wpointer-arith -Wwrite-strings -Wdeclaration-after-statement -Wimplicit-function-declaration -Wdeprecated-declarations -Wno-packed-bitfield-compat conftest.c  -L. -L../.. -L. -fstack-protector -rdynamic -Wl,-export-dynamic     -Wl,-rpath,<build-dir>/lib -L<build-dir>/lib -lruby-static -lcrypto  -lpthread -ldl -lcrypt -lm   -lc"
+/usr/bin/ld: <build-dir>/tmp/ccPnuLuF.o: in function `t':
 <build-dir>/ruby/ext/openssl/conftest.c:14: undefined reference to `OpenSSL_add_all_digests'
 collect2: error: ld returned 1 exit status
 checked program was:
@@ 27280 @@
 TestTempfile#test_close_with_unlink_now_true_works = <elapsed> s = .
 TestTempfile#test_concurrency = <elapsed> s = .
 TestTempfile#test_create_traversal_dir = <elapsed> s = .
+Leaked file descriptor: TestTempfile#test_create_traversal_dir: <fd> : #<File:<build-dir>/tmp/..............datachkbuildtmpbuild<buildtime>rubyfoo20181105-30673-1umuzp1>
 TestTempfile#test_create_with_block = <elapsed> s = .
 Closed file descriptor: <test-method>: <fd>
 TestTempfile#test_create_without_block = <elapsed> s = .

===================================================================
--- 20181105T043431Z
@@ 152 @@
 Gid:	1003	1003	1003	1003
 FDSize:	64
 Groups:	1003
-NStgid:	30814
-NSpid:	30814
-NSpgid:	30814
-NSsid:	23735
 VmPeak: <nnn> kB
 VmSize: <nnn> kB
 VmLck: <nnn> kB
 VmPin:	       0 kB
 VmHWM: <nnn> kB
 VmRSS: <nnn> kB
-RssAnon:	      60 kB
 RssFile:	     716 kB
 RssShmem:	       0 kB
 VmData: <nnn> kB
@@ 17982 @@
 
  <n>) Error:
 TestRDocRubygemsHook#test_setup:
-RuntimeError: no  in [#<Digest::SHA512: 16128d37c93ca3f74983852137ada7d6680f3e18749c1c4ef798b182fcf1997961331caa1c32a17c6c5cea9403ddd7382e21648e1036606436ff89630c241064>]
     <build-dir>/ruby/lib/rubygems/package/tar_writer.rb:<line_a>:in `add_file_signed'
     <build-dir>/ruby/lib/rubygems/package.rb:<line_a>:in `add_metadata'
     <build-dir>/ruby/lib/rubygems/package.rb:<line_a>:in `block (2 levels) in build'
@@ 18002 @@
 
  <n>) Error:
 TestRDocRubygemsHook#test_remove:
-RuntimeError: no  in [#<Digest::SHA512: 16128d37c93ca3f74983852137ada7d6680f3e18749c1c4ef798b182fcf1997961331caa1c32a17c6c5cea9403ddd7382e21648e1036606436ff89630c241064>]
     <build-dir>/ruby/lib/rubygems/package/tar_writer.rb:<line_a>:in `add_file_signed'
     <build-dir>/ruby/lib/rubygems/package.rb:<line_a>:in `add_metadata'
     <build-dir>/ruby/lib/rubygems/package.rb:<line_a>:in `block (2 levels) in build'
@@ 18022 @@
 
  <n>) Error:
 TestRDocRubygemsHook#test_ri_installed?:
-RuntimeError: no  in [#<Digest::SHA512: 16128d37c93ca3f74983852137ada7d6680f3e18749c1c4ef798b182fcf1997961331caa1c32a17c6c5cea9403ddd7382e21648e1036606436ff89630c241064>]
     <build-dir>/ruby/lib/rubygems/package/tar_writer.rb:<line_a>:in `add_file_signed'
     <build-dir>/ruby/lib/rubygems/package.rb:<line_a>:in `add_metadata'
     <build-dir>/ruby/lib/rubygems/package.rb:<line_a>:in `block (2 levels) in build'
@@ 18042 @@
 
  <n>) Error:
 TestRDocRubygemsHook#test_delete_legacy_args:
-RuntimeError: no  in [#<Digest::SHA512: 16128d37c93ca3f74983852137ada7d6680f3e18749c1c4ef798b182fcf1997961331caa1c32a17c6c5cea9403ddd7382e21648e1036606436ff89630c241064>]
     <build-dir>/ruby/lib/rubygems/package/tar_writer.rb:<line_a>:in `add_file_signed'
     <build-dir>/ruby/lib/rubygems/package.rb:<line_a>:in `add_metadata'
     <build-dir>/ruby/lib/rubygems/package.rb:<line_a>:in `block (2 levels) in build'
@@ 18062 @@
 
  <n>) Error:
 TestRDocRubygemsHook#test_generate_default_gem:
-RuntimeError: no  in [#<Digest::SHA512: 16128d37c93ca3f74983852137ada7d6680f3e18749c1c4ef798b182fcf1997961331caa1c32a17c6c5cea9403ddd7382e21648e1036606436ff89630c241064>]
     <build-dir>/ruby/lib/rubygems/package/tar_writer.rb:<line_a>:in `add_file_signed'
     <build-dir>/ruby/lib/rubygems/package.rb:<line_a>:in `add_metadata'
     <build-dir>/ruby/lib/rubygems/package.rb:<line_a>:in `block (2 levels) in build'
@@ 18082 @@
 
  <n>) Error:
 TestRDocRubygemsHook#test_setup_unwritable:
-RuntimeError: no  in [#<Digest::SHA512: d2648cdee244a011b50b4475fa29758eeeb60c931a04a7f3d8b260846aab1456e86e50236bff834294201bd2230a29ee7649f88baaafe62ced05f2e4468c8589>]
     <build-dir>/ruby/lib/rubygems/package/tar_writer.rb:<line_a>:in `add_file_signed'
     <build-dir>/ruby/lib/rubygems/package.rb:<line_a>:in `add_metadata'
     <build-dir>/ruby/lib/rubygems/package.rb:<line_a>:in `block (2 levels) in build'
@@ 18102 @@
 
  <n>) Error:
 TestRDocRubygemsHook#test_document:
-RuntimeError: no  in [#<Digest::SHA512: d2648cdee244a011b50b4475fa29758eeeb60c931a04a7f3d8b260846aab1456e86e50236bff834294201bd2230a29ee7649f88baaafe62ced05f2e4468c8589>]
     <build-dir>/ruby/lib/rubygems/package/tar_writer.rb:<line_a>:in `add_file_signed'
     <build-dir>/ruby/lib/rubygems/package.rb:<line_a>:in `add_metadata'
     <build-dir>/ruby/lib/rubygems/package.rb:<line_a>:in `block (2 levels) in build'
@@ 18122 @@
 
  <n>) Error:
 TestRDocRubygemsHook#test_generate:
-RuntimeError: no  in [#<Digest::SHA512: d2648cdee244a011b50b4475fa29758eeeb60c931a04a7f3d8b260846aab1456e86e50236bff834294201bd2230a29ee7649f88baaafe62ced05f2e4468c8589>]
     <build-dir>/ruby/lib/rubygems/package/tar_writer.rb:<line_a>:in `add_file_signed'
     <build-dir>/ruby/lib/rubygems/package.rb:<line_a>:in `add_metadata'
     <build-dir>/ruby/lib/rubygems/package.rb:<line_a>:in `block (2 levels) in build'
@@ 18142 @@
 
  <n>) Error:
 TestRDocRubygemsHook#test_generate_force:
-RuntimeError: no  in [#<Digest::SHA512: d2648cdee244a011b50b4475fa29758eeeb60c931a04a7f3d8b260846aab1456e86e50236bff834294201bd2230a29ee7649f88baaafe62ced05f2e4468c8589>]
     <build-dir>/ruby/lib/rubygems/package/tar_writer.rb:<line_a>:in `add_file_signed'
     <build-dir>/ruby/lib/rubygems/package.rb:<line_a>:in `add_metadata'
     <build-dir>/ruby/lib/rubygems/package.rb:<line_a>:in `block (2 levels) in build'
@@ 18162 @@
 
  <n>) Error:
 TestRDocRubygemsHook#test_generate_no_overwrite:
-RuntimeError: no  in [#<Digest::SHA512: d2648cdee244a011b50b4475fa29758eeeb60c931a04a7f3d8b260846aab1456e86e50236bff834294201bd2230a29ee7649f88baaafe62ced05f2e4468c8589>]
     <build-dir>/ruby/lib/rubygems/package/tar_writer.rb:<line_a>:in `add_file_signed'
     <build-dir>/ruby/lib/rubygems/package.rb:<line_a>:in `add_metadata'
     <build-dir>/ruby/lib/rubygems/package.rb:<line_a>:in `block (2 levels) in build'
@@ 18182 @@
 
  <n>) Error:
 TestRDocRubygemsHook#test_initialize:
-RuntimeError: no  in [#<Digest::SHA512: d2648cdee244a011b50b4475fa29758eeeb60c931a04a7f3d8b260846aab1456e86e50236bff834294201bd2230a29ee7649f88baaafe62ced05f2e4468c8589>]
     <build-dir>/ruby/lib/rubygems/package/tar_writer.rb:<line_a>:in `add_file_signed'
     <build-dir>/ruby/lib/rubygems/package.rb:<line_a>:in `add_metadata'
     <build-dir>/ruby/lib/rubygems/package.rb:<line_a>:in `block (2 levels) in build'
@@ 18202 @@
 
  <n>) Error:
 TestRDocRubygemsHook#test_remove_unwritable:
-RuntimeError: no  in [#<Digest::SHA512: d2648cdee244a011b50b4475fa29758eeeb60c931a04a7f3d8b260846aab1456e86e50236bff834294201bd2230a29ee7649f88baaafe62ced05f2e4468c8589>]
     <build-dir>/ruby/lib/rubygems/package/tar_writer.rb:<line_a>:in `add_file_signed'
     <build-dir>/ruby/lib/rubygems/package.rb:<line_a>:in `add_metadata'
     <build-dir>/ruby/lib/rubygems/package.rb:<line_a>:in `block (2 levels) in build'
@@ 18222 @@
 
  <n>) Error:
 TestRDocRubygemsHook#test_generate_disabled:
-RuntimeError: no  in [#<Digest::SHA512: d2648cdee244a011b50b4475fa29758eeeb60c931a04a7f3d8b260846aab1456e86e50236bff834294201bd2230a29ee7649f88baaafe62ced05f2e4468c8589>]
     <build-dir>/ruby/lib/rubygems/package/tar_writer.rb:<line_a>:in `add_file_signed'
     <build-dir>/ruby/lib/rubygems/package.rb:<line_a>:in `add_metadata'
     <build-dir>/ruby/lib/rubygems/package.rb:<line_a>:in `block (2 levels) in build'
@@ 18242 @@
 
  <n>) Error:
 TestRDocRubygemsHook#test_generate_configuration_rdoc_array:
-RuntimeError: no  in [#<Digest::SHA512: d2648cdee244a011b50b4475fa29758eeeb60c931a04a7f3d8b260846aab1456e86e50236bff834294201bd2230a29ee7649f88baaafe62ced05f2e4468c8589>]
     <build-dir>/ruby/lib/rubygems/package/tar_writer.rb:<line_a>:in `add_file_signed'
     <build-dir>/ruby/lib/rubygems/package.rb:<line_a>:in `add_metadata'
     <build-dir>/ruby/lib/rubygems/package.rb:<line_a>:in `block (2 levels) in build'
@@ 18262 @@
 
  <n>) Error:
 TestRDocRubygemsHook#test_rdoc_installed?:
-RuntimeError: no  in [#<Digest::SHA512: d2648cdee244a011b50b4475fa29758eeeb60c931a04a7f3d8b260846aab1456e86e50236bff834294201bd2230a29ee7649f88baaafe62ced05f2e4468c8589>]
     <build-dir>/ruby/lib/rubygems/package/tar_writer.rb:<line_a>:in `add_file_signed'
     <build-dir>/ruby/lib/rubygems/package.rb:<line_a>:in `add_metadata'
     <build-dir>/ruby/lib/rubygems/package.rb:<line_a>:in `block (2 levels) in build'
@@ 18282 @@
 
  <n>) Error:
 TestRDocRubygemsHook#test_generate_all:
-RuntimeError: no  in [#<Digest::SHA512: d2648cdee244a011b50b4475fa29758eeeb60c931a04a7f3d8b260846aab1456e86e50236bff834294201bd2230a29ee7649f88baaafe62ced05f2e4468c8589>]
     <build-dir>/ruby/lib/rubygems/package/tar_writer.rb:<line_a>:in `add_file_signed'
     <build-dir>/ruby/lib/rubygems/package.rb:<line_a>:in `add_metadata'
     <build-dir>/ruby/lib/rubygems/package.rb:<line_a>:in `block (2 levels) in build'
@@ 18302 @@
 
  <n>) Error:
 TestRDocRubygemsHook#test_new_rdoc:
-RuntimeError: no  in [#<Digest::SHA512: d2648cdee244a011b50b4475fa29758eeeb60c931a04a7f3d8b260846aab1456e86e50236bff834294201bd2230a29ee7649f88baaafe62ced05f2e4468c8589>]
     <build-dir>/ruby/lib/rubygems/package/tar_writer.rb:<line_a>:in `add_file_signed'
     <build-dir>/ruby/lib/rubygems/package.rb:<line_a>:in `add_metadata'
     <build-dir>/ruby/lib/rubygems/package.rb:<line_a>:in `block (2 levels) in build'
@@ 18322 @@
 
  <n>) Error:
 TestRDocRubygemsHook#test_generate_configuration_rdoc_string:
-RuntimeError: no  in [#<Digest::SHA512: d2648cdee244a011b50b4475fa29758eeeb60c931a04a7f3d8b260846aab1456e86e50236bff834294201bd2230a29ee7649f88baaafe62ced05f2e4468c8589>]
     <build-dir>/ruby/lib/rubygems/package/tar_writer.rb:<line_a>:in `add_file_signed'
     <build-dir>/ruby/lib/rubygems/package.rb:<line_a>:in `add_metadata'
     <build-dir>/ruby/lib/rubygems/package.rb:<line_a>:in `block (2 levels) in build'
@@ 24536 @@
 /* end */
 
 "gcc -o conftest -I../../.ext/include/x86_64-linux -I../.././include -I../.././ext/openssl -DRUBY_DEBUG_ENV    -O3 -fno-fast-math -ggdb3 -Wall -Wextra -Wno-unused-parameter -Wno-parentheses -Wno-long-long -Wno-missing-field-initializers -Wunused-variable -Wpointer-arith -Wwrite-strings -Wdeclaration-after-statement -Wimplicit-function-declaration -Wdeprecated-declarations -Wno-packed-bitfield-compat conftest.c  -L. -L../.. -L. -fstack-protector -rdynamic -Wl,-export-dynamic     -Wl,-rpath,<build-dir>/lib -L<build-dir>/lib -lruby-static -lnsl  -lpthread -ldl -lcrypt -lm   -lc"
-/usr/bin/ld: <build-dir>/tmp/ccsKpQF0.o: in function `t':
 <build-dir>/ruby/ext/openssl/conftest.c:14: undefined reference to `t_open'
 collect2: error: ld returned 1 exit status
 checked program was:
@@ 24660 @@
 /* end */
 
 "gcc -o conftest -I../../.ext/include/x86_64-linux -I../.././include -I../.././ext/openssl -DRUBY_DEBUG_ENV    -O3 -fno-fast-math -ggdb3 -Wall -Wextra -Wno-unused-parameter -Wno-parentheses -Wno-long-long -Wno-missing-field-initializers -Wunused-variable -Wpointer-arith -Wwrite-strings -Wdeclaration-after-statement -Wimplicit-function-declaration -Wdeprecated-declarations -Wno-packed-bitfield-compat conftest.c  -L. -L../.. -L. -fstack-protector -rdynamic -Wl,-export-dynamic     -Wl,-rpath,<build-dir>/lib -L<build-dir>/lib -lruby-static -lcrypto  -lpthread -ldl -lcrypt -lm   -lc"
-/usr/bin/ld: <build-dir>/tmp/ccnQD06N.o: in function `t':
 <build-dir>/ruby/ext/openssl/conftest.c:14: undefined reference to `OpenSSL_add_all_digests'
 collect2: error: ld returned 1 exit status
 checked program was:
@@ 27281 @@
 TestTempfile#test_close_with_unlink_now_true_works = <elapsed> s = .
 TestTempfile#test_concurrency = <elapsed> s = .
 TestTempfile#test_create_traversal_dir = <elapsed> s = .
-Leaked file descriptor: TestTempfile#test_create_traversal_dir: <fd> : #<File:<build-dir>/tmp/..............datachkbuildtmpbuild<buildtime>rubyfoo20181105-6302-1fhlwix>
 TestTempfile#test_create_with_block = <elapsed> s = .
 Closed file descriptor: <test-method>: <fd>
 TestTempfile#test_create_without_block = <elapsed> s = .

OlderDiff < 20181105T043431Z(failure) < ThisDiff > 20181105T073747Z(failure) > NewerDiff


chkbuild summary recent last