r65135 ruby 2.3.8p459 (2018-10-18) [x86_64-linux] [2.3] (ubuntu) 1024W failed(test-all) 4failed(test/) rubyspec:4F7E

chkbuild summary recent last

OlderDiff < 20181106T013808Z(failure) < ThisDiff > 20181106T043530Z(failure) > NewerDiff

===================================================================
+++ 20181106T043530Z
@@ 152 @@
 Gid:	1003	1003	1003	1003
 FDSize:	64
 Groups:	1003
+NStgid:	30262
+NSpid:	30262
+NSpgid:	30262
+NSsid:	22223
 VmPeak: <nnn> kB
 VmSize: <nnn> kB
 VmLck: <nnn> kB
 VmPin:	       0 kB
 VmHWM: <nnn> kB
 VmRSS: <nnn> kB
+RssAnon:	      68 kB
+RssFile:	     716 kB
 RssShmem:	       0 kB
 VmData: <nnn> kB
 VmStk: <nnn> kB
@@ 17982 @@
 
  <n>) Error:
 TestRDocRubygemsHook#test_new_rdoc:
+RuntimeError: no  in [#<Digest::SHA512: 4043e56dee7a95486926d13f2319ef93068b0bd29e862bd73243f0ed4eae663e80b7f858e1244e16006af9e6965ee2f7d44aba1a6a2ae7ffd14de3930b8c1ed3>]
     <build-dir>/ruby/lib/rubygems/package/tar_writer.rb:<line_a>:in `add_file_signed'
     <build-dir>/ruby/lib/rubygems/package.rb:<line_a>:in `add_metadata'
     <build-dir>/ruby/lib/rubygems/package.rb:<line_a>:in `block (2 levels) in build'
@@ 18002 @@
 
  <n>) Error:
 TestRDocRubygemsHook#test_generate_configuration_rdoc_array:
+RuntimeError: no  in [#<Digest::SHA512: 4043e56dee7a95486926d13f2319ef93068b0bd29e862bd73243f0ed4eae663e80b7f858e1244e16006af9e6965ee2f7d44aba1a6a2ae7ffd14de3930b8c1ed3>]
     <build-dir>/ruby/lib/rubygems/package/tar_writer.rb:<line_a>:in `add_file_signed'
     <build-dir>/ruby/lib/rubygems/package.rb:<line_a>:in `add_metadata'
     <build-dir>/ruby/lib/rubygems/package.rb:<line_a>:in `block (2 levels) in build'
@@ 18022 @@
 
  <n>) Error:
 TestRDocRubygemsHook#test_remove_unwritable:
+RuntimeError: no  in [#<Digest::SHA512: 4043e56dee7a95486926d13f2319ef93068b0bd29e862bd73243f0ed4eae663e80b7f858e1244e16006af9e6965ee2f7d44aba1a6a2ae7ffd14de3930b8c1ed3>]
     <build-dir>/ruby/lib/rubygems/package/tar_writer.rb:<line_a>:in `add_file_signed'
     <build-dir>/ruby/lib/rubygems/package.rb:<line_a>:in `add_metadata'
     <build-dir>/ruby/lib/rubygems/package.rb:<line_a>:in `block (2 levels) in build'
@@ 18042 @@
 
  <n>) Error:
 TestRDocRubygemsHook#test_generate_force:
+RuntimeError: no  in [#<Digest::SHA512: 4043e56dee7a95486926d13f2319ef93068b0bd29e862bd73243f0ed4eae663e80b7f858e1244e16006af9e6965ee2f7d44aba1a6a2ae7ffd14de3930b8c1ed3>]
     <build-dir>/ruby/lib/rubygems/package/tar_writer.rb:<line_a>:in `add_file_signed'
     <build-dir>/ruby/lib/rubygems/package.rb:<line_a>:in `add_metadata'
     <build-dir>/ruby/lib/rubygems/package.rb:<line_a>:in `block (2 levels) in build'
@@ 18062 @@
 
  <n>) Error:
 TestRDocRubygemsHook#test_setup:
+RuntimeError: no  in [#<Digest::SHA512: 4043e56dee7a95486926d13f2319ef93068b0bd29e862bd73243f0ed4eae663e80b7f858e1244e16006af9e6965ee2f7d44aba1a6a2ae7ffd14de3930b8c1ed3>]
     <build-dir>/ruby/lib/rubygems/package/tar_writer.rb:<line_a>:in `add_file_signed'
     <build-dir>/ruby/lib/rubygems/package.rb:<line_a>:in `add_metadata'
     <build-dir>/ruby/lib/rubygems/package.rb:<line_a>:in `block (2 levels) in build'
@@ 18082 @@
 
  <n>) Error:
 TestRDocRubygemsHook#test_generate_disabled:
+RuntimeError: no  in [#<Digest::SHA512: 4043e56dee7a95486926d13f2319ef93068b0bd29e862bd73243f0ed4eae663e80b7f858e1244e16006af9e6965ee2f7d44aba1a6a2ae7ffd14de3930b8c1ed3>]
     <build-dir>/ruby/lib/rubygems/package/tar_writer.rb:<line_a>:in `add_file_signed'
     <build-dir>/ruby/lib/rubygems/package.rb:<line_a>:in `add_metadata'
     <build-dir>/ruby/lib/rubygems/package.rb:<line_a>:in `block (2 levels) in build'
@@ 18102 @@
 
  <n>) Error:
 TestRDocRubygemsHook#test_initialize:
+RuntimeError: no  in [#<Digest::SHA512: 4043e56dee7a95486926d13f2319ef93068b0bd29e862bd73243f0ed4eae663e80b7f858e1244e16006af9e6965ee2f7d44aba1a6a2ae7ffd14de3930b8c1ed3>]
     <build-dir>/ruby/lib/rubygems/package/tar_writer.rb:<line_a>:in `add_file_signed'
     <build-dir>/ruby/lib/rubygems/package.rb:<line_a>:in `add_metadata'
     <build-dir>/ruby/lib/rubygems/package.rb:<line_a>:in `block (2 levels) in build'
@@ 18122 @@
 
  <n>) Error:
 TestRDocRubygemsHook#test_generate_default_gem:
+RuntimeError: no  in [#<Digest::SHA512: f175a5dfe738c1571805fc44d5af01193bc7f3fe409a1a15dd2d1ea73d42dcc985b496eb32956b3d70bf5c816e6e7f3816e3e892ccf729febab34a6d102f9986>]
     <build-dir>/ruby/lib/rubygems/package/tar_writer.rb:<line_a>:in `add_file_signed'
     <build-dir>/ruby/lib/rubygems/package.rb:<line_a>:in `add_metadata'
     <build-dir>/ruby/lib/rubygems/package.rb:<line_a>:in `block (2 levels) in build'
@@ 18142 @@
 
  <n>) Error:
 TestRDocRubygemsHook#test_document:
+RuntimeError: no  in [#<Digest::SHA512: f175a5dfe738c1571805fc44d5af01193bc7f3fe409a1a15dd2d1ea73d42dcc985b496eb32956b3d70bf5c816e6e7f3816e3e892ccf729febab34a6d102f9986>]
     <build-dir>/ruby/lib/rubygems/package/tar_writer.rb:<line_a>:in `add_file_signed'
     <build-dir>/ruby/lib/rubygems/package.rb:<line_a>:in `add_metadata'
     <build-dir>/ruby/lib/rubygems/package.rb:<line_a>:in `block (2 levels) in build'
@@ 18162 @@
 
  <n>) Error:
 TestRDocRubygemsHook#test_remove:
+RuntimeError: no  in [#<Digest::SHA512: f175a5dfe738c1571805fc44d5af01193bc7f3fe409a1a15dd2d1ea73d42dcc985b496eb32956b3d70bf5c816e6e7f3816e3e892ccf729febab34a6d102f9986>]
     <build-dir>/ruby/lib/rubygems/package/tar_writer.rb:<line_a>:in `add_file_signed'
     <build-dir>/ruby/lib/rubygems/package.rb:<line_a>:in `add_metadata'
     <build-dir>/ruby/lib/rubygems/package.rb:<line_a>:in `block (2 levels) in build'
@@ 18182 @@
 
  <n>) Error:
 TestRDocRubygemsHook#test_delete_legacy_args:
+RuntimeError: no  in [#<Digest::SHA512: f175a5dfe738c1571805fc44d5af01193bc7f3fe409a1a15dd2d1ea73d42dcc985b496eb32956b3d70bf5c816e6e7f3816e3e892ccf729febab34a6d102f9986>]
     <build-dir>/ruby/lib/rubygems/package/tar_writer.rb:<line_a>:in `add_file_signed'
     <build-dir>/ruby/lib/rubygems/package.rb:<line_a>:in `add_metadata'
     <build-dir>/ruby/lib/rubygems/package.rb:<line_a>:in `block (2 levels) in build'
@@ 18202 @@
 
  <n>) Error:
 TestRDocRubygemsHook#test_rdoc_installed?:
+RuntimeError: no  in [#<Digest::SHA512: f175a5dfe738c1571805fc44d5af01193bc7f3fe409a1a15dd2d1ea73d42dcc985b496eb32956b3d70bf5c816e6e7f3816e3e892ccf729febab34a6d102f9986>]
     <build-dir>/ruby/lib/rubygems/package/tar_writer.rb:<line_a>:in `add_file_signed'
     <build-dir>/ruby/lib/rubygems/package.rb:<line_a>:in `add_metadata'
     <build-dir>/ruby/lib/rubygems/package.rb:<line_a>:in `block (2 levels) in build'
@@ 18222 @@
 
  <n>) Error:
 TestRDocRubygemsHook#test_ri_installed?:
+RuntimeError: no  in [#<Digest::SHA512: f175a5dfe738c1571805fc44d5af01193bc7f3fe409a1a15dd2d1ea73d42dcc985b496eb32956b3d70bf5c816e6e7f3816e3e892ccf729febab34a6d102f9986>]
     <build-dir>/ruby/lib/rubygems/package/tar_writer.rb:<line_a>:in `add_file_signed'
     <build-dir>/ruby/lib/rubygems/package.rb:<line_a>:in `add_metadata'
     <build-dir>/ruby/lib/rubygems/package.rb:<line_a>:in `block (2 levels) in build'
@@ 18242 @@
 
  <n>) Error:
 TestRDocRubygemsHook#test_generate_no_overwrite:
+RuntimeError: no  in [#<Digest::SHA512: f175a5dfe738c1571805fc44d5af01193bc7f3fe409a1a15dd2d1ea73d42dcc985b496eb32956b3d70bf5c816e6e7f3816e3e892ccf729febab34a6d102f9986>]
     <build-dir>/ruby/lib/rubygems/package/tar_writer.rb:<line_a>:in `add_file_signed'
     <build-dir>/ruby/lib/rubygems/package.rb:<line_a>:in `add_metadata'
     <build-dir>/ruby/lib/rubygems/package.rb:<line_a>:in `block (2 levels) in build'
@@ 18262 @@
 
  <n>) Error:
 TestRDocRubygemsHook#test_generate_all:
+RuntimeError: no  in [#<Digest::SHA512: f175a5dfe738c1571805fc44d5af01193bc7f3fe409a1a15dd2d1ea73d42dcc985b496eb32956b3d70bf5c816e6e7f3816e3e892ccf729febab34a6d102f9986>]
     <build-dir>/ruby/lib/rubygems/package/tar_writer.rb:<line_a>:in `add_file_signed'
     <build-dir>/ruby/lib/rubygems/package.rb:<line_a>:in `add_metadata'
     <build-dir>/ruby/lib/rubygems/package.rb:<line_a>:in `block (2 levels) in build'
@@ 18282 @@
 
  <n>) Error:
 TestRDocRubygemsHook#test_setup_unwritable:
+RuntimeError: no  in [#<Digest::SHA512: f175a5dfe738c1571805fc44d5af01193bc7f3fe409a1a15dd2d1ea73d42dcc985b496eb32956b3d70bf5c816e6e7f3816e3e892ccf729febab34a6d102f9986>]
     <build-dir>/ruby/lib/rubygems/package/tar_writer.rb:<line_a>:in `add_file_signed'
     <build-dir>/ruby/lib/rubygems/package.rb:<line_a>:in `add_metadata'
     <build-dir>/ruby/lib/rubygems/package.rb:<line_a>:in `block (2 levels) in build'
@@ 18302 @@
 
  <n>) Error:
 TestRDocRubygemsHook#test_generate:
+RuntimeError: no  in [#<Digest::SHA512: f175a5dfe738c1571805fc44d5af01193bc7f3fe409a1a15dd2d1ea73d42dcc985b496eb32956b3d70bf5c816e6e7f3816e3e892ccf729febab34a6d102f9986>]
     <build-dir>/ruby/lib/rubygems/package/tar_writer.rb:<line_a>:in `add_file_signed'
     <build-dir>/ruby/lib/rubygems/package.rb:<line_a>:in `add_metadata'
     <build-dir>/ruby/lib/rubygems/package.rb:<line_a>:in `block (2 levels) in build'
@@ 18322 @@
 
  <n>) Error:
 TestRDocRubygemsHook#test_generate_configuration_rdoc_string:
+RuntimeError: no  in [#<Digest::SHA512: f175a5dfe738c1571805fc44d5af01193bc7f3fe409a1a15dd2d1ea73d42dcc985b496eb32956b3d70bf5c816e6e7f3816e3e892ccf729febab34a6d102f9986>]
     <build-dir>/ruby/lib/rubygems/package/tar_writer.rb:<line_a>:in `add_file_signed'
     <build-dir>/ruby/lib/rubygems/package.rb:<line_a>:in `add_metadata'
     <build-dir>/ruby/lib/rubygems/package.rb:<line_a>:in `block (2 levels) in build'
@@ 24536 @@
 /* end */
 
 "gcc -o conftest -I../../.ext/include/x86_64-linux -I../.././include -I../.././ext/openssl -DRUBY_DEBUG_ENV    -O3 -fno-fast-math -ggdb3 -Wall -Wextra -Wno-unused-parameter -Wno-parentheses -Wno-long-long -Wno-missing-field-initializers -Wunused-variable -Wpointer-arith -Wwrite-strings -Wdeclaration-after-statement -Wimplicit-function-declaration -Wdeprecated-declarations -Wno-packed-bitfield-compat conftest.c  -L. -L../.. -L. -fstack-protector -rdynamic -Wl,-export-dynamic     -Wl,-rpath,<build-dir>/lib -L<build-dir>/lib -lruby-static -lnsl  -lpthread -ldl -lcrypt -lm   -lc"
+/usr/bin/ld: <build-dir>/tmp/ccpjFi48.o: in function `t':
 <build-dir>/ruby/ext/openssl/conftest.c:14: undefined reference to `t_open'
 collect2: error: ld returned 1 exit status
 checked program was:
@@ 24660 @@
 /* end */
 
 "gcc -o conftest -I../../.ext/include/x86_64-linux -I../.././include -I../.././ext/openssl -DRUBY_DEBUG_ENV    -O3 -fno-fast-math -ggdb3 -Wall -Wextra -Wno-unused-parameter -Wno-parentheses -Wno-long-long -Wno-missing-field-initializers -Wunused-variable -Wpointer-arith -Wwrite-strings -Wdeclaration-after-statement -Wimplicit-function-declaration -Wdeprecated-declarations -Wno-packed-bitfield-compat conftest.c  -L. -L../.. -L. -fstack-protector -rdynamic -Wl,-export-dynamic     -Wl,-rpath,<build-dir>/lib -L<build-dir>/lib -lruby-static -lcrypto  -lpthread -ldl -lcrypt -lm   -lc"
+/usr/bin/ld: <build-dir>/tmp/ccq1fxmH.o: in function `t':
 <build-dir>/ruby/ext/openssl/conftest.c:14: undefined reference to `OpenSSL_add_all_digests'
 collect2: error: ld returned 1 exit status
 checked program was:
@@ 27281 @@
 TestTempfile#test_close_with_unlink_now_true_works = <elapsed> s = .
 TestTempfile#test_concurrency = <elapsed> s = .
 TestTempfile#test_create_traversal_dir = <elapsed> s = .
+Leaked file descriptor: TestTempfile#test_create_traversal_dir: <fd> : #<File:<build-dir>/tmp/..............datachkbuildtmpbuild<buildtime>rubyfoo20181106-6442-1f7r5fa>
 TestTempfile#test_create_with_block = <elapsed> s = .
 Closed file descriptor: <test-method>: <fd>
 TestTempfile#test_create_without_block = <elapsed> s = .

===================================================================
--- 20181106T013808Z
@@ 152 @@
 Gid:	1003	1003	1003	1003
 FDSize:	64
 Groups:	1003
-NStgid:	9512
-NSpid:	9512
-NSpgid:	9512
-NSsid:	32078
 VmPeak: <nnn> kB
 VmSize: <nnn> kB
 VmLck: <nnn> kB
 VmPin:	       0 kB
 VmHWM: <nnn> kB
 VmRSS: <nnn> kB
-RssAnon:	      60 kB
-RssFile:	     776 kB
 RssShmem:	       0 kB
 VmData: <nnn> kB
 VmStk: <nnn> kB
@@ 17982 @@
 
  <n>) Error:
 TestRDocRubygemsHook#test_generate_force:
-RuntimeError: no  in [#<Digest::SHA512: d6a455e8694b9f5261aabdc19a1d43e273ecc97da6cea8c9ec3227cb2d08ee3e680707a6bc2576edc6344f6d30c19e3395ffb639cb7eeb95a490db62fe1da85c>]
     <build-dir>/ruby/lib/rubygems/package/tar_writer.rb:<line_a>:in `add_file_signed'
     <build-dir>/ruby/lib/rubygems/package.rb:<line_a>:in `add_metadata'
     <build-dir>/ruby/lib/rubygems/package.rb:<line_a>:in `block (2 levels) in build'
@@ 18002 @@
 
  <n>) Error:
 TestRDocRubygemsHook#test_initialize:
-RuntimeError: no  in [#<Digest::SHA512: d6a455e8694b9f5261aabdc19a1d43e273ecc97da6cea8c9ec3227cb2d08ee3e680707a6bc2576edc6344f6d30c19e3395ffb639cb7eeb95a490db62fe1da85c>]
     <build-dir>/ruby/lib/rubygems/package/tar_writer.rb:<line_a>:in `add_file_signed'
     <build-dir>/ruby/lib/rubygems/package.rb:<line_a>:in `add_metadata'
     <build-dir>/ruby/lib/rubygems/package.rb:<line_a>:in `block (2 levels) in build'
@@ 18022 @@
 
  <n>) Error:
 TestRDocRubygemsHook#test_delete_legacy_args:
-RuntimeError: no  in [#<Digest::SHA512: d6a455e8694b9f5261aabdc19a1d43e273ecc97da6cea8c9ec3227cb2d08ee3e680707a6bc2576edc6344f6d30c19e3395ffb639cb7eeb95a490db62fe1da85c>]
     <build-dir>/ruby/lib/rubygems/package/tar_writer.rb:<line_a>:in `add_file_signed'
     <build-dir>/ruby/lib/rubygems/package.rb:<line_a>:in `add_metadata'
     <build-dir>/ruby/lib/rubygems/package.rb:<line_a>:in `block (2 levels) in build'
@@ 18042 @@
 
  <n>) Error:
 TestRDocRubygemsHook#test_remove_unwritable:
-RuntimeError: no  in [#<Digest::SHA512: d6a455e8694b9f5261aabdc19a1d43e273ecc97da6cea8c9ec3227cb2d08ee3e680707a6bc2576edc6344f6d30c19e3395ffb639cb7eeb95a490db62fe1da85c>]
     <build-dir>/ruby/lib/rubygems/package/tar_writer.rb:<line_a>:in `add_file_signed'
     <build-dir>/ruby/lib/rubygems/package.rb:<line_a>:in `add_metadata'
     <build-dir>/ruby/lib/rubygems/package.rb:<line_a>:in `block (2 levels) in build'
@@ 18062 @@
 
  <n>) Error:
 TestRDocRubygemsHook#test_new_rdoc:
-RuntimeError: no  in [#<Digest::SHA512: d6a455e8694b9f5261aabdc19a1d43e273ecc97da6cea8c9ec3227cb2d08ee3e680707a6bc2576edc6344f6d30c19e3395ffb639cb7eeb95a490db62fe1da85c>]
     <build-dir>/ruby/lib/rubygems/package/tar_writer.rb:<line_a>:in `add_file_signed'
     <build-dir>/ruby/lib/rubygems/package.rb:<line_a>:in `add_metadata'
     <build-dir>/ruby/lib/rubygems/package.rb:<line_a>:in `block (2 levels) in build'
@@ 18082 @@
 
  <n>) Error:
 TestRDocRubygemsHook#test_document:
-RuntimeError: no  in [#<Digest::SHA512: d6a455e8694b9f5261aabdc19a1d43e273ecc97da6cea8c9ec3227cb2d08ee3e680707a6bc2576edc6344f6d30c19e3395ffb639cb7eeb95a490db62fe1da85c>]
     <build-dir>/ruby/lib/rubygems/package/tar_writer.rb:<line_a>:in `add_file_signed'
     <build-dir>/ruby/lib/rubygems/package.rb:<line_a>:in `add_metadata'
     <build-dir>/ruby/lib/rubygems/package.rb:<line_a>:in `block (2 levels) in build'
@@ 18102 @@
 
  <n>) Error:
 TestRDocRubygemsHook#test_generate_disabled:
-RuntimeError: no  in [#<Digest::SHA512: d6a455e8694b9f5261aabdc19a1d43e273ecc97da6cea8c9ec3227cb2d08ee3e680707a6bc2576edc6344f6d30c19e3395ffb639cb7eeb95a490db62fe1da85c>]
     <build-dir>/ruby/lib/rubygems/package/tar_writer.rb:<line_a>:in `add_file_signed'
     <build-dir>/ruby/lib/rubygems/package.rb:<line_a>:in `add_metadata'
     <build-dir>/ruby/lib/rubygems/package.rb:<line_a>:in `block (2 levels) in build'
@@ 18122 @@
 
  <n>) Error:
 TestRDocRubygemsHook#test_generate_configuration_rdoc_array:
-RuntimeError: no  in [#<Digest::SHA512: d6a455e8694b9f5261aabdc19a1d43e273ecc97da6cea8c9ec3227cb2d08ee3e680707a6bc2576edc6344f6d30c19e3395ffb639cb7eeb95a490db62fe1da85c>]
     <build-dir>/ruby/lib/rubygems/package/tar_writer.rb:<line_a>:in `add_file_signed'
     <build-dir>/ruby/lib/rubygems/package.rb:<line_a>:in `add_metadata'
     <build-dir>/ruby/lib/rubygems/package.rb:<line_a>:in `block (2 levels) in build'
@@ 18142 @@
 
  <n>) Error:
 TestRDocRubygemsHook#test_generate_configuration_rdoc_string:
-RuntimeError: no  in [#<Digest::SHA512: d6a455e8694b9f5261aabdc19a1d43e273ecc97da6cea8c9ec3227cb2d08ee3e680707a6bc2576edc6344f6d30c19e3395ffb639cb7eeb95a490db62fe1da85c>]
     <build-dir>/ruby/lib/rubygems/package/tar_writer.rb:<line_a>:in `add_file_signed'
     <build-dir>/ruby/lib/rubygems/package.rb:<line_a>:in `add_metadata'
     <build-dir>/ruby/lib/rubygems/package.rb:<line_a>:in `block (2 levels) in build'
@@ 18162 @@
 
  <n>) Error:
 TestRDocRubygemsHook#test_rdoc_installed?:
-RuntimeError: no  in [#<Digest::SHA512: d6a455e8694b9f5261aabdc19a1d43e273ecc97da6cea8c9ec3227cb2d08ee3e680707a6bc2576edc6344f6d30c19e3395ffb639cb7eeb95a490db62fe1da85c>]
     <build-dir>/ruby/lib/rubygems/package/tar_writer.rb:<line_a>:in `add_file_signed'
     <build-dir>/ruby/lib/rubygems/package.rb:<line_a>:in `add_metadata'
     <build-dir>/ruby/lib/rubygems/package.rb:<line_a>:in `block (2 levels) in build'
@@ 18182 @@
 
  <n>) Error:
 TestRDocRubygemsHook#test_setup:
-RuntimeError: no  in [#<Digest::SHA512: d6a455e8694b9f5261aabdc19a1d43e273ecc97da6cea8c9ec3227cb2d08ee3e680707a6bc2576edc6344f6d30c19e3395ffb639cb7eeb95a490db62fe1da85c>]
     <build-dir>/ruby/lib/rubygems/package/tar_writer.rb:<line_a>:in `add_file_signed'
     <build-dir>/ruby/lib/rubygems/package.rb:<line_a>:in `add_metadata'
     <build-dir>/ruby/lib/rubygems/package.rb:<line_a>:in `block (2 levels) in build'
@@ 18202 @@
 
  <n>) Error:
 TestRDocRubygemsHook#test_generate:
-RuntimeError: no  in [#<Digest::SHA512: d6a455e8694b9f5261aabdc19a1d43e273ecc97da6cea8c9ec3227cb2d08ee3e680707a6bc2576edc6344f6d30c19e3395ffb639cb7eeb95a490db62fe1da85c>]
     <build-dir>/ruby/lib/rubygems/package/tar_writer.rb:<line_a>:in `add_file_signed'
     <build-dir>/ruby/lib/rubygems/package.rb:<line_a>:in `add_metadata'
     <build-dir>/ruby/lib/rubygems/package.rb:<line_a>:in `block (2 levels) in build'
@@ 18222 @@
 
  <n>) Error:
 TestRDocRubygemsHook#test_setup_unwritable:
-RuntimeError: no  in [#<Digest::SHA512: d6a455e8694b9f5261aabdc19a1d43e273ecc97da6cea8c9ec3227cb2d08ee3e680707a6bc2576edc6344f6d30c19e3395ffb639cb7eeb95a490db62fe1da85c>]
     <build-dir>/ruby/lib/rubygems/package/tar_writer.rb:<line_a>:in `add_file_signed'
     <build-dir>/ruby/lib/rubygems/package.rb:<line_a>:in `add_metadata'
     <build-dir>/ruby/lib/rubygems/package.rb:<line_a>:in `block (2 levels) in build'
@@ 18242 @@
 
  <n>) Error:
 TestRDocRubygemsHook#test_generate_all:
-RuntimeError: no  in [#<Digest::SHA512: d6a455e8694b9f5261aabdc19a1d43e273ecc97da6cea8c9ec3227cb2d08ee3e680707a6bc2576edc6344f6d30c19e3395ffb639cb7eeb95a490db62fe1da85c>]
     <build-dir>/ruby/lib/rubygems/package/tar_writer.rb:<line_a>:in `add_file_signed'
     <build-dir>/ruby/lib/rubygems/package.rb:<line_a>:in `add_metadata'
     <build-dir>/ruby/lib/rubygems/package.rb:<line_a>:in `block (2 levels) in build'
@@ 18262 @@
 
  <n>) Error:
 TestRDocRubygemsHook#test_generate_default_gem:
-RuntimeError: no  in [#<Digest::SHA512: d6a455e8694b9f5261aabdc19a1d43e273ecc97da6cea8c9ec3227cb2d08ee3e680707a6bc2576edc6344f6d30c19e3395ffb639cb7eeb95a490db62fe1da85c>]
     <build-dir>/ruby/lib/rubygems/package/tar_writer.rb:<line_a>:in `add_file_signed'
     <build-dir>/ruby/lib/rubygems/package.rb:<line_a>:in `add_metadata'
     <build-dir>/ruby/lib/rubygems/package.rb:<line_a>:in `block (2 levels) in build'
@@ 18282 @@
 
  <n>) Error:
 TestRDocRubygemsHook#test_generate_no_overwrite:
-RuntimeError: no  in [#<Digest::SHA512: d6a455e8694b9f5261aabdc19a1d43e273ecc97da6cea8c9ec3227cb2d08ee3e680707a6bc2576edc6344f6d30c19e3395ffb639cb7eeb95a490db62fe1da85c>]
     <build-dir>/ruby/lib/rubygems/package/tar_writer.rb:<line_a>:in `add_file_signed'
     <build-dir>/ruby/lib/rubygems/package.rb:<line_a>:in `add_metadata'
     <build-dir>/ruby/lib/rubygems/package.rb:<line_a>:in `block (2 levels) in build'
@@ 18302 @@
 
  <n>) Error:
 TestRDocRubygemsHook#test_ri_installed?:
-RuntimeError: no  in [#<Digest::SHA512: d6a455e8694b9f5261aabdc19a1d43e273ecc97da6cea8c9ec3227cb2d08ee3e680707a6bc2576edc6344f6d30c19e3395ffb639cb7eeb95a490db62fe1da85c>]
     <build-dir>/ruby/lib/rubygems/package/tar_writer.rb:<line_a>:in `add_file_signed'
     <build-dir>/ruby/lib/rubygems/package.rb:<line_a>:in `add_metadata'
     <build-dir>/ruby/lib/rubygems/package.rb:<line_a>:in `block (2 levels) in build'
@@ 18322 @@
 
  <n>) Error:
 TestRDocRubygemsHook#test_remove:
-RuntimeError: no  in [#<Digest::SHA512: d6a455e8694b9f5261aabdc19a1d43e273ecc97da6cea8c9ec3227cb2d08ee3e680707a6bc2576edc6344f6d30c19e3395ffb639cb7eeb95a490db62fe1da85c>]
     <build-dir>/ruby/lib/rubygems/package/tar_writer.rb:<line_a>:in `add_file_signed'
     <build-dir>/ruby/lib/rubygems/package.rb:<line_a>:in `add_metadata'
     <build-dir>/ruby/lib/rubygems/package.rb:<line_a>:in `block (2 levels) in build'
@@ 24536 @@
 /* end */
 
 "gcc -o conftest -I../../.ext/include/x86_64-linux -I../.././include -I../.././ext/openssl -DRUBY_DEBUG_ENV    -O3 -fno-fast-math -ggdb3 -Wall -Wextra -Wno-unused-parameter -Wno-parentheses -Wno-long-long -Wno-missing-field-initializers -Wunused-variable -Wpointer-arith -Wwrite-strings -Wdeclaration-after-statement -Wimplicit-function-declaration -Wdeprecated-declarations -Wno-packed-bitfield-compat conftest.c  -L. -L../.. -L. -fstack-protector -rdynamic -Wl,-export-dynamic     -Wl,-rpath,<build-dir>/lib -L<build-dir>/lib -lruby-static -lnsl  -lpthread -ldl -lcrypt -lm   -lc"
-/usr/bin/ld: <build-dir>/tmp/cc9WxgHi.o: in function `t':
 <build-dir>/ruby/ext/openssl/conftest.c:14: undefined reference to `t_open'
 collect2: error: ld returned 1 exit status
 checked program was:
@@ 24660 @@
 /* end */
 
 "gcc -o conftest -I../../.ext/include/x86_64-linux -I../.././include -I../.././ext/openssl -DRUBY_DEBUG_ENV    -O3 -fno-fast-math -ggdb3 -Wall -Wextra -Wno-unused-parameter -Wno-parentheses -Wno-long-long -Wno-missing-field-initializers -Wunused-variable -Wpointer-arith -Wwrite-strings -Wdeclaration-after-statement -Wimplicit-function-declaration -Wdeprecated-declarations -Wno-packed-bitfield-compat conftest.c  -L. -L../.. -L. -fstack-protector -rdynamic -Wl,-export-dynamic     -Wl,-rpath,<build-dir>/lib -L<build-dir>/lib -lruby-static -lcrypto  -lpthread -ldl -lcrypt -lm   -lc"
-/usr/bin/ld: <build-dir>/tmp/ccLZ2sXT.o: in function `t':
 <build-dir>/ruby/ext/openssl/conftest.c:14: undefined reference to `OpenSSL_add_all_digests'
 collect2: error: ld returned 1 exit status
 checked program was:
@@ 27281 @@
 TestTempfile#test_close_with_unlink_now_true_works = <elapsed> s = .
 TestTempfile#test_concurrency = <elapsed> s = .
 TestTempfile#test_create_traversal_dir = <elapsed> s = .
-Leaked file descriptor: TestTempfile#test_create_traversal_dir: <fd> : #<File:<build-dir>/tmp/..............datachkbuildtmpbuild<buildtime>rubyfoo20181106-14952-mrqixe>
 TestTempfile#test_create_with_block = <elapsed> s = .
 Closed file descriptor: <test-method>: <fd>
 TestTempfile#test_create_without_block = <elapsed> s = .

OlderDiff < 20181106T013808Z(failure) < ThisDiff > 20181106T043530Z(failure) > NewerDiff


chkbuild summary recent last