r65135 ruby 2.3.8p459 (2018-10-18) [x86_64-linux] [2.3] (ubuntu) 1024W failed(test-all) 4failed(test/) rubyspec:5F7E

chkbuild summary recent last

OlderDiff < 20181109T013510Z(failure) < ThisDiff > 20181109T043750Z(failure) > NewerDiff

===================================================================
+++ 20181109T043750Z
@@ 152 @@
 Gid:	1003	1003	1003	1003
 FDSize:	64
 Groups:	1003
+NStgid:	22315
+NSpid:	22315
+NSpgid:	22315
+NSsid:	16762
 VmPeak: <nnn> kB
 VmSize: <nnn> kB
 VmLck: <nnn> kB
 VmPin:	       0 kB
 VmHWM: <nnn> kB
 VmRSS: <nnn> kB
+RssAnon:	      64 kB
+RssFile:	     692 kB
 RssShmem:	       0 kB
 VmData: <nnn> kB
 VmStk: <nnn> kB
@@ 1994 @@
 internal.h:<line_a>:30: warning: this use of "defined" may not be portable [-Wexpansion-to-defined]
 compiling enc/ascii.c
 compiling enc/us_ascii.c
+/bin/mkdir -p enc/unicode
++ cp enc/unicode/name2ctype.h.blt enc/unicode/name2ctype.h
 compiling enc/unicode.c
 compiling enc/utf_8.c
 generating enc/trans/newline.c ...
@@ 17984 @@
 
  <n>) Error:
 TestRDocRubygemsHook#test_generate_configuration_rdoc_string:
+RuntimeError: no  in [#<Digest::SHA512: 7d243be6e3a5875e4a17a7e2a05e72d4f776c52c98f9441f84740a6c2e3043c451cfdc76825de15dcf72a9be45d974db5906b430f6a7d98d49d5538527a53702>]
     <build-dir>/ruby/lib/rubygems/package/tar_writer.rb:<line_a>:in `add_file_signed'
     <build-dir>/ruby/lib/rubygems/package.rb:<line_a>:in `add_metadata'
     <build-dir>/ruby/lib/rubygems/package.rb:<line_a>:in `block (2 levels) in build'
@@ 18004 @@
 
  <n>) Error:
 TestRDocRubygemsHook#test_initialize:
+RuntimeError: no  in [#<Digest::SHA512: 7d243be6e3a5875e4a17a7e2a05e72d4f776c52c98f9441f84740a6c2e3043c451cfdc76825de15dcf72a9be45d974db5906b430f6a7d98d49d5538527a53702>]
     <build-dir>/ruby/lib/rubygems/package/tar_writer.rb:<line_a>:in `add_file_signed'
     <build-dir>/ruby/lib/rubygems/package.rb:<line_a>:in `add_metadata'
     <build-dir>/ruby/lib/rubygems/package.rb:<line_a>:in `block (2 levels) in build'
@@ 18024 @@
 
  <n>) Error:
 TestRDocRubygemsHook#test_setup:
+RuntimeError: no  in [#<Digest::SHA512: 7d243be6e3a5875e4a17a7e2a05e72d4f776c52c98f9441f84740a6c2e3043c451cfdc76825de15dcf72a9be45d974db5906b430f6a7d98d49d5538527a53702>]
     <build-dir>/ruby/lib/rubygems/package/tar_writer.rb:<line_a>:in `add_file_signed'
     <build-dir>/ruby/lib/rubygems/package.rb:<line_a>:in `add_metadata'
     <build-dir>/ruby/lib/rubygems/package.rb:<line_a>:in `block (2 levels) in build'
@@ 18044 @@
 
  <n>) Error:
 TestRDocRubygemsHook#test_setup_unwritable:
+RuntimeError: no  in [#<Digest::SHA512: 7d243be6e3a5875e4a17a7e2a05e72d4f776c52c98f9441f84740a6c2e3043c451cfdc76825de15dcf72a9be45d974db5906b430f6a7d98d49d5538527a53702>]
     <build-dir>/ruby/lib/rubygems/package/tar_writer.rb:<line_a>:in `add_file_signed'
     <build-dir>/ruby/lib/rubygems/package.rb:<line_a>:in `add_metadata'
     <build-dir>/ruby/lib/rubygems/package.rb:<line_a>:in `block (2 levels) in build'
@@ 18064 @@
 
  <n>) Error:
 TestRDocRubygemsHook#test_generate_disabled:
+RuntimeError: no  in [#<Digest::SHA512: 7d243be6e3a5875e4a17a7e2a05e72d4f776c52c98f9441f84740a6c2e3043c451cfdc76825de15dcf72a9be45d974db5906b430f6a7d98d49d5538527a53702>]
     <build-dir>/ruby/lib/rubygems/package/tar_writer.rb:<line_a>:in `add_file_signed'
     <build-dir>/ruby/lib/rubygems/package.rb:<line_a>:in `add_metadata'
     <build-dir>/ruby/lib/rubygems/package.rb:<line_a>:in `block (2 levels) in build'
@@ 18084 @@
 
  <n>) Error:
 TestRDocRubygemsHook#test_generate_no_overwrite:
+RuntimeError: no  in [#<Digest::SHA512: 7d243be6e3a5875e4a17a7e2a05e72d4f776c52c98f9441f84740a6c2e3043c451cfdc76825de15dcf72a9be45d974db5906b430f6a7d98d49d5538527a53702>]
     <build-dir>/ruby/lib/rubygems/package/tar_writer.rb:<line_a>:in `add_file_signed'
     <build-dir>/ruby/lib/rubygems/package.rb:<line_a>:in `add_metadata'
     <build-dir>/ruby/lib/rubygems/package.rb:<line_a>:in `block (2 levels) in build'
@@ 18104 @@
 
  <n>) Error:
 TestRDocRubygemsHook#test_ri_installed?:
+RuntimeError: no  in [#<Digest::SHA512: 7d243be6e3a5875e4a17a7e2a05e72d4f776c52c98f9441f84740a6c2e3043c451cfdc76825de15dcf72a9be45d974db5906b430f6a7d98d49d5538527a53702>]
     <build-dir>/ruby/lib/rubygems/package/tar_writer.rb:<line_a>:in `add_file_signed'
     <build-dir>/ruby/lib/rubygems/package.rb:<line_a>:in `add_metadata'
     <build-dir>/ruby/lib/rubygems/package.rb:<line_a>:in `block (2 levels) in build'
@@ 18124 @@
 
  <n>) Error:
 TestRDocRubygemsHook#test_generate:
+RuntimeError: no  in [#<Digest::SHA512: 7d243be6e3a5875e4a17a7e2a05e72d4f776c52c98f9441f84740a6c2e3043c451cfdc76825de15dcf72a9be45d974db5906b430f6a7d98d49d5538527a53702>]
     <build-dir>/ruby/lib/rubygems/package/tar_writer.rb:<line_a>:in `add_file_signed'
     <build-dir>/ruby/lib/rubygems/package.rb:<line_a>:in `add_metadata'
     <build-dir>/ruby/lib/rubygems/package.rb:<line_a>:in `block (2 levels) in build'
@@ 18144 @@
 
  <n>) Error:
 TestRDocRubygemsHook#test_document:
+RuntimeError: no  in [#<Digest::SHA512: 7d243be6e3a5875e4a17a7e2a05e72d4f776c52c98f9441f84740a6c2e3043c451cfdc76825de15dcf72a9be45d974db5906b430f6a7d98d49d5538527a53702>]
     <build-dir>/ruby/lib/rubygems/package/tar_writer.rb:<line_a>:in `add_file_signed'
     <build-dir>/ruby/lib/rubygems/package.rb:<line_a>:in `add_metadata'
     <build-dir>/ruby/lib/rubygems/package.rb:<line_a>:in `block (2 levels) in build'
@@ 18164 @@
 
  <n>) Error:
 TestRDocRubygemsHook#test_generate_all:
+RuntimeError: no  in [#<Digest::SHA512: 7d243be6e3a5875e4a17a7e2a05e72d4f776c52c98f9441f84740a6c2e3043c451cfdc76825de15dcf72a9be45d974db5906b430f6a7d98d49d5538527a53702>]
     <build-dir>/ruby/lib/rubygems/package/tar_writer.rb:<line_a>:in `add_file_signed'
     <build-dir>/ruby/lib/rubygems/package.rb:<line_a>:in `add_metadata'
     <build-dir>/ruby/lib/rubygems/package.rb:<line_a>:in `block (2 levels) in build'
@@ 18184 @@
 
  <n>) Error:
 TestRDocRubygemsHook#test_rdoc_installed?:
+RuntimeError: no  in [#<Digest::SHA512: 7d243be6e3a5875e4a17a7e2a05e72d4f776c52c98f9441f84740a6c2e3043c451cfdc76825de15dcf72a9be45d974db5906b430f6a7d98d49d5538527a53702>]
     <build-dir>/ruby/lib/rubygems/package/tar_writer.rb:<line_a>:in `add_file_signed'
     <build-dir>/ruby/lib/rubygems/package.rb:<line_a>:in `add_metadata'
     <build-dir>/ruby/lib/rubygems/package.rb:<line_a>:in `block (2 levels) in build'
@@ 18204 @@
 
  <n>) Error:
 TestRDocRubygemsHook#test_new_rdoc:
+RuntimeError: no  in [#<Digest::SHA512: 7d243be6e3a5875e4a17a7e2a05e72d4f776c52c98f9441f84740a6c2e3043c451cfdc76825de15dcf72a9be45d974db5906b430f6a7d98d49d5538527a53702>]
     <build-dir>/ruby/lib/rubygems/package/tar_writer.rb:<line_a>:in `add_file_signed'
     <build-dir>/ruby/lib/rubygems/package.rb:<line_a>:in `add_metadata'
     <build-dir>/ruby/lib/rubygems/package.rb:<line_a>:in `block (2 levels) in build'
@@ 18224 @@
 
  <n>) Error:
 TestRDocRubygemsHook#test_remove_unwritable:
+RuntimeError: no  in [#<Digest::SHA512: 7d243be6e3a5875e4a17a7e2a05e72d4f776c52c98f9441f84740a6c2e3043c451cfdc76825de15dcf72a9be45d974db5906b430f6a7d98d49d5538527a53702>]
     <build-dir>/ruby/lib/rubygems/package/tar_writer.rb:<line_a>:in `add_file_signed'
     <build-dir>/ruby/lib/rubygems/package.rb:<line_a>:in `add_metadata'
     <build-dir>/ruby/lib/rubygems/package.rb:<line_a>:in `block (2 levels) in build'
@@ 18244 @@
 
  <n>) Error:
 TestRDocRubygemsHook#test_delete_legacy_args:
+RuntimeError: no  in [#<Digest::SHA512: 7d243be6e3a5875e4a17a7e2a05e72d4f776c52c98f9441f84740a6c2e3043c451cfdc76825de15dcf72a9be45d974db5906b430f6a7d98d49d5538527a53702>]
     <build-dir>/ruby/lib/rubygems/package/tar_writer.rb:<line_a>:in `add_file_signed'
     <build-dir>/ruby/lib/rubygems/package.rb:<line_a>:in `add_metadata'
     <build-dir>/ruby/lib/rubygems/package.rb:<line_a>:in `block (2 levels) in build'
@@ 18264 @@
 
  <n>) Error:
 TestRDocRubygemsHook#test_remove:
+RuntimeError: no  in [#<Digest::SHA512: 7d243be6e3a5875e4a17a7e2a05e72d4f776c52c98f9441f84740a6c2e3043c451cfdc76825de15dcf72a9be45d974db5906b430f6a7d98d49d5538527a53702>]
     <build-dir>/ruby/lib/rubygems/package/tar_writer.rb:<line_a>:in `add_file_signed'
     <build-dir>/ruby/lib/rubygems/package.rb:<line_a>:in `add_metadata'
     <build-dir>/ruby/lib/rubygems/package.rb:<line_a>:in `block (2 levels) in build'
@@ 18284 @@
 
  <n>) Error:
 TestRDocRubygemsHook#test_generate_configuration_rdoc_array:
+RuntimeError: no  in [#<Digest::SHA512: 7d243be6e3a5875e4a17a7e2a05e72d4f776c52c98f9441f84740a6c2e3043c451cfdc76825de15dcf72a9be45d974db5906b430f6a7d98d49d5538527a53702>]
     <build-dir>/ruby/lib/rubygems/package/tar_writer.rb:<line_a>:in `add_file_signed'
     <build-dir>/ruby/lib/rubygems/package.rb:<line_a>:in `add_metadata'
     <build-dir>/ruby/lib/rubygems/package.rb:<line_a>:in `block (2 levels) in build'
@@ 18304 @@
 
  <n>) Error:
 TestRDocRubygemsHook#test_generate_default_gem:
+RuntimeError: no  in [#<Digest::SHA512: 7d243be6e3a5875e4a17a7e2a05e72d4f776c52c98f9441f84740a6c2e3043c451cfdc76825de15dcf72a9be45d974db5906b430f6a7d98d49d5538527a53702>]
     <build-dir>/ruby/lib/rubygems/package/tar_writer.rb:<line_a>:in `add_file_signed'
     <build-dir>/ruby/lib/rubygems/package.rb:<line_a>:in `add_metadata'
     <build-dir>/ruby/lib/rubygems/package.rb:<line_a>:in `block (2 levels) in build'
@@ 18324 @@
 
  <n>) Error:
 TestRDocRubygemsHook#test_generate_force:
+RuntimeError: no  in [#<Digest::SHA512: 7d243be6e3a5875e4a17a7e2a05e72d4f776c52c98f9441f84740a6c2e3043c451cfdc76825de15dcf72a9be45d974db5906b430f6a7d98d49d5538527a53702>]
     <build-dir>/ruby/lib/rubygems/package/tar_writer.rb:<line_a>:in `add_file_signed'
     <build-dir>/ruby/lib/rubygems/package.rb:<line_a>:in `add_metadata'
     <build-dir>/ruby/lib/rubygems/package.rb:<line_a>:in `block (2 levels) in build'
@@ 24538 @@
 /* end */
 
 "gcc -o conftest -I../../.ext/include/x86_64-linux -I../.././include -I../.././ext/openssl -DRUBY_DEBUG_ENV    -O3 -fno-fast-math -ggdb3 -Wall -Wextra -Wno-unused-parameter -Wno-parentheses -Wno-long-long -Wno-missing-field-initializers -Wunused-variable -Wpointer-arith -Wwrite-strings -Wdeclaration-after-statement -Wimplicit-function-declaration -Wdeprecated-declarations -Wno-packed-bitfield-compat conftest.c  -L. -L../.. -L. -fstack-protector -rdynamic -Wl,-export-dynamic     -Wl,-rpath,<build-dir>/lib -L<build-dir>/lib -lruby-static -lnsl  -lpthread -ldl -lcrypt -lm   -lc"
+/usr/bin/ld: <build-dir>/tmp/ccD9Y42d.o: in function `t':
 <build-dir>/ruby/ext/openssl/conftest.c:14: undefined reference to `t_open'
 collect2: error: ld returned 1 exit status
 checked program was:
@@ 24662 @@
 /* end */
 
 "gcc -o conftest -I../../.ext/include/x86_64-linux -I../.././include -I../.././ext/openssl -DRUBY_DEBUG_ENV    -O3 -fno-fast-math -ggdb3 -Wall -Wextra -Wno-unused-parameter -Wno-parentheses -Wno-long-long -Wno-missing-field-initializers -Wunused-variable -Wpointer-arith -Wwrite-strings -Wdeclaration-after-statement -Wimplicit-function-declaration -Wdeprecated-declarations -Wno-packed-bitfield-compat conftest.c  -L. -L../.. -L. -fstack-protector -rdynamic -Wl,-export-dynamic     -Wl,-rpath,<build-dir>/lib -L<build-dir>/lib -lruby-static -lcrypto  -lpthread -ldl -lcrypt -lm   -lc"
+/usr/bin/ld: <build-dir>/tmp/ccwtBNVO.o: in function `t':
 <build-dir>/ruby/ext/openssl/conftest.c:14: undefined reference to `OpenSSL_add_all_digests'
 collect2: error: ld returned 1 exit status
 checked program was:
@@ 27295 @@
 TestTempfile#test_close_with_unlink_now_true_works = <elapsed> s = .
 TestTempfile#test_concurrency = <elapsed> s = .
 TestTempfile#test_create_traversal_dir = <elapsed> s = .
+Leaked file descriptor: TestTempfile#test_create_traversal_dir: <fd> : #<File:<build-dir>/tmp/..............datachkbuildtmpbuild<buildtime>rubyfoo20181109-29665-1gf0en8>
 TestTempfile#test_create_with_block = <elapsed> s = .
 Closed file descriptor: <test-method>: <fd>
 TestTempfile#test_create_without_block = <elapsed> s = .
@@ 60598 @@
 - supports escaping characters when used as a terminator
 - treats an escaped non-escapable character normally when used as a terminator
 - does not support handling unicode 9.0 characters with POSIX bracket expressions
+- supports handling unicode 8.0 characters with POSIX bracket expressions (FAILED - <n>)
 
 <build-dir>/rubyspec/language/rescue_spec.rb
 The rescue keyword
@@ 77645 @@
 <build-dir>/rubyspec/core/file/stat/rdev_minor_spec.rb:<line_a>:in `<top (required)>'
 
  <n>)
+Literal Regexps supports handling unicode 8.0 characters with POSIX bracket expressions FAILED
+Expected ""
+ to equal "\uA7B5"
 
+<build-dir>/rubyspec/language/regexp_spec.rb:<line_a>:in `block (3 levels) in <top (required)>'
+<build-dir>/rubyspec/language/regexp_spec.rb:<line_a>:in `<top (required)>'
 
  <n>)
 An exception occurred during: loading <build-dir>/rubyspec/library/openssl/cipher_spec.rb ERROR

===================================================================
--- 20181109T013510Z
@@ 152 @@
 Gid:	1003	1003	1003	1003
 FDSize:	64
 Groups:	1003
-NStgid:	2522
-NSpid:	2522
-NSpgid:	2522
-NSsid:	25741
 VmPeak: <nnn> kB
 VmSize: <nnn> kB
 VmLck: <nnn> kB
 VmPin:	       0 kB
 VmHWM: <nnn> kB
 VmRSS: <nnn> kB
-RssAnon:	      68 kB
-RssFile:	     752 kB
 RssShmem:	       0 kB
 VmData: <nnn> kB
 VmStk: <nnn> kB
@@ 17982 @@
 
  <n>) Error:
 TestRDocRubygemsHook#test_generate_disabled:
-RuntimeError: no  in [#<Digest::SHA512: 7ddbb55b1c8a22322ee14ab4acea2dda63ffc3eb0e6890610906cfdb9bb4aadde403cb188a736e10fe392895222eb383609e69de3f5569a2166ae2436b315290>]
     <build-dir>/ruby/lib/rubygems/package/tar_writer.rb:<line_a>:in `add_file_signed'
     <build-dir>/ruby/lib/rubygems/package.rb:<line_a>:in `add_metadata'
     <build-dir>/ruby/lib/rubygems/package.rb:<line_a>:in `block (2 levels) in build'
@@ 18002 @@
 
  <n>) Error:
 TestRDocRubygemsHook#test_generate_no_overwrite:
-RuntimeError: no  in [#<Digest::SHA512: 7ddbb55b1c8a22322ee14ab4acea2dda63ffc3eb0e6890610906cfdb9bb4aadde403cb188a736e10fe392895222eb383609e69de3f5569a2166ae2436b315290>]
     <build-dir>/ruby/lib/rubygems/package/tar_writer.rb:<line_a>:in `add_file_signed'
     <build-dir>/ruby/lib/rubygems/package.rb:<line_a>:in `add_metadata'
     <build-dir>/ruby/lib/rubygems/package.rb:<line_a>:in `block (2 levels) in build'
@@ 18022 @@
 
  <n>) Error:
 TestRDocRubygemsHook#test_generate_force:
-RuntimeError: no  in [#<Digest::SHA512: 7ddbb55b1c8a22322ee14ab4acea2dda63ffc3eb0e6890610906cfdb9bb4aadde403cb188a736e10fe392895222eb383609e69de3f5569a2166ae2436b315290>]
     <build-dir>/ruby/lib/rubygems/package/tar_writer.rb:<line_a>:in `add_file_signed'
     <build-dir>/ruby/lib/rubygems/package.rb:<line_a>:in `add_metadata'
     <build-dir>/ruby/lib/rubygems/package.rb:<line_a>:in `block (2 levels) in build'
@@ 18042 @@
 
  <n>) Error:
 TestRDocRubygemsHook#test_remove:
-RuntimeError: no  in [#<Digest::SHA512: 7ddbb55b1c8a22322ee14ab4acea2dda63ffc3eb0e6890610906cfdb9bb4aadde403cb188a736e10fe392895222eb383609e69de3f5569a2166ae2436b315290>]
     <build-dir>/ruby/lib/rubygems/package/tar_writer.rb:<line_a>:in `add_file_signed'
     <build-dir>/ruby/lib/rubygems/package.rb:<line_a>:in `add_metadata'
     <build-dir>/ruby/lib/rubygems/package.rb:<line_a>:in `block (2 levels) in build'
@@ 18062 @@
 
  <n>) Error:
 TestRDocRubygemsHook#test_setup:
-RuntimeError: no  in [#<Digest::SHA512: 7ddbb55b1c8a22322ee14ab4acea2dda63ffc3eb0e6890610906cfdb9bb4aadde403cb188a736e10fe392895222eb383609e69de3f5569a2166ae2436b315290>]
     <build-dir>/ruby/lib/rubygems/package/tar_writer.rb:<line_a>:in `add_file_signed'
     <build-dir>/ruby/lib/rubygems/package.rb:<line_a>:in `add_metadata'
     <build-dir>/ruby/lib/rubygems/package.rb:<line_a>:in `block (2 levels) in build'
@@ 18082 @@
 
  <n>) Error:
 TestRDocRubygemsHook#test_generate_configuration_rdoc_string:
-RuntimeError: no  in [#<Digest::SHA512: 7ddbb55b1c8a22322ee14ab4acea2dda63ffc3eb0e6890610906cfdb9bb4aadde403cb188a736e10fe392895222eb383609e69de3f5569a2166ae2436b315290>]
     <build-dir>/ruby/lib/rubygems/package/tar_writer.rb:<line_a>:in `add_file_signed'
     <build-dir>/ruby/lib/rubygems/package.rb:<line_a>:in `add_metadata'
     <build-dir>/ruby/lib/rubygems/package.rb:<line_a>:in `block (2 levels) in build'
@@ 18102 @@
 
  <n>) Error:
 TestRDocRubygemsHook#test_document:
-RuntimeError: no  in [#<Digest::SHA512: 7ddbb55b1c8a22322ee14ab4acea2dda63ffc3eb0e6890610906cfdb9bb4aadde403cb188a736e10fe392895222eb383609e69de3f5569a2166ae2436b315290>]
     <build-dir>/ruby/lib/rubygems/package/tar_writer.rb:<line_a>:in `add_file_signed'
     <build-dir>/ruby/lib/rubygems/package.rb:<line_a>:in `add_metadata'
     <build-dir>/ruby/lib/rubygems/package.rb:<line_a>:in `block (2 levels) in build'
@@ 18122 @@
 
  <n>) Error:
 TestRDocRubygemsHook#test_rdoc_installed?:
-RuntimeError: no  in [#<Digest::SHA512: 7ddbb55b1c8a22322ee14ab4acea2dda63ffc3eb0e6890610906cfdb9bb4aadde403cb188a736e10fe392895222eb383609e69de3f5569a2166ae2436b315290>]
     <build-dir>/ruby/lib/rubygems/package/tar_writer.rb:<line_a>:in `add_file_signed'
     <build-dir>/ruby/lib/rubygems/package.rb:<line_a>:in `add_metadata'
     <build-dir>/ruby/lib/rubygems/package.rb:<line_a>:in `block (2 levels) in build'
@@ 18142 @@
 
  <n>) Error:
 TestRDocRubygemsHook#test_remove_unwritable:
-RuntimeError: no  in [#<Digest::SHA512: 7ddbb55b1c8a22322ee14ab4acea2dda63ffc3eb0e6890610906cfdb9bb4aadde403cb188a736e10fe392895222eb383609e69de3f5569a2166ae2436b315290>]
     <build-dir>/ruby/lib/rubygems/package/tar_writer.rb:<line_a>:in `add_file_signed'
     <build-dir>/ruby/lib/rubygems/package.rb:<line_a>:in `add_metadata'
     <build-dir>/ruby/lib/rubygems/package.rb:<line_a>:in `block (2 levels) in build'
@@ 18162 @@
 
  <n>) Error:
 TestRDocRubygemsHook#test_initialize:
-RuntimeError: no  in [#<Digest::SHA512: 7ddbb55b1c8a22322ee14ab4acea2dda63ffc3eb0e6890610906cfdb9bb4aadde403cb188a736e10fe392895222eb383609e69de3f5569a2166ae2436b315290>]
     <build-dir>/ruby/lib/rubygems/package/tar_writer.rb:<line_a>:in `add_file_signed'
     <build-dir>/ruby/lib/rubygems/package.rb:<line_a>:in `add_metadata'
     <build-dir>/ruby/lib/rubygems/package.rb:<line_a>:in `block (2 levels) in build'
@@ 18182 @@
 
  <n>) Error:
 TestRDocRubygemsHook#test_generate:
-RuntimeError: no  in [#<Digest::SHA512: 7ddbb55b1c8a22322ee14ab4acea2dda63ffc3eb0e6890610906cfdb9bb4aadde403cb188a736e10fe392895222eb383609e69de3f5569a2166ae2436b315290>]
     <build-dir>/ruby/lib/rubygems/package/tar_writer.rb:<line_a>:in `add_file_signed'
     <build-dir>/ruby/lib/rubygems/package.rb:<line_a>:in `add_metadata'
     <build-dir>/ruby/lib/rubygems/package.rb:<line_a>:in `block (2 levels) in build'
@@ 18202 @@
 
  <n>) Error:
 TestRDocRubygemsHook#test_ri_installed?:
-RuntimeError: no  in [#<Digest::SHA512: 7ddbb55b1c8a22322ee14ab4acea2dda63ffc3eb0e6890610906cfdb9bb4aadde403cb188a736e10fe392895222eb383609e69de3f5569a2166ae2436b315290>]
     <build-dir>/ruby/lib/rubygems/package/tar_writer.rb:<line_a>:in `add_file_signed'
     <build-dir>/ruby/lib/rubygems/package.rb:<line_a>:in `add_metadata'
     <build-dir>/ruby/lib/rubygems/package.rb:<line_a>:in `block (2 levels) in build'
@@ 18222 @@
 
  <n>) Error:
 TestRDocRubygemsHook#test_delete_legacy_args:
-RuntimeError: no  in [#<Digest::SHA512: 7ddbb55b1c8a22322ee14ab4acea2dda63ffc3eb0e6890610906cfdb9bb4aadde403cb188a736e10fe392895222eb383609e69de3f5569a2166ae2436b315290>]
     <build-dir>/ruby/lib/rubygems/package/tar_writer.rb:<line_a>:in `add_file_signed'
     <build-dir>/ruby/lib/rubygems/package.rb:<line_a>:in `add_metadata'
     <build-dir>/ruby/lib/rubygems/package.rb:<line_a>:in `block (2 levels) in build'
@@ 18242 @@
 
  <n>) Error:
 TestRDocRubygemsHook#test_setup_unwritable:
-RuntimeError: no  in [#<Digest::SHA512: 7ddbb55b1c8a22322ee14ab4acea2dda63ffc3eb0e6890610906cfdb9bb4aadde403cb188a736e10fe392895222eb383609e69de3f5569a2166ae2436b315290>]
     <build-dir>/ruby/lib/rubygems/package/tar_writer.rb:<line_a>:in `add_file_signed'
     <build-dir>/ruby/lib/rubygems/package.rb:<line_a>:in `add_metadata'
     <build-dir>/ruby/lib/rubygems/package.rb:<line_a>:in `block (2 levels) in build'
@@ 18262 @@
 
  <n>) Error:
 TestRDocRubygemsHook#test_generate_all:
-RuntimeError: no  in [#<Digest::SHA512: 7ddbb55b1c8a22322ee14ab4acea2dda63ffc3eb0e6890610906cfdb9bb4aadde403cb188a736e10fe392895222eb383609e69de3f5569a2166ae2436b315290>]
     <build-dir>/ruby/lib/rubygems/package/tar_writer.rb:<line_a>:in `add_file_signed'
     <build-dir>/ruby/lib/rubygems/package.rb:<line_a>:in `add_metadata'
     <build-dir>/ruby/lib/rubygems/package.rb:<line_a>:in `block (2 levels) in build'
@@ 18282 @@
 
  <n>) Error:
 TestRDocRubygemsHook#test_generate_configuration_rdoc_array:
-RuntimeError: no  in [#<Digest::SHA512: 7ddbb55b1c8a22322ee14ab4acea2dda63ffc3eb0e6890610906cfdb9bb4aadde403cb188a736e10fe392895222eb383609e69de3f5569a2166ae2436b315290>]
     <build-dir>/ruby/lib/rubygems/package/tar_writer.rb:<line_a>:in `add_file_signed'
     <build-dir>/ruby/lib/rubygems/package.rb:<line_a>:in `add_metadata'
     <build-dir>/ruby/lib/rubygems/package.rb:<line_a>:in `block (2 levels) in build'
@@ 18302 @@
 
  <n>) Error:
 TestRDocRubygemsHook#test_new_rdoc:
-RuntimeError: no  in [#<Digest::SHA512: 7ddbb55b1c8a22322ee14ab4acea2dda63ffc3eb0e6890610906cfdb9bb4aadde403cb188a736e10fe392895222eb383609e69de3f5569a2166ae2436b315290>]
     <build-dir>/ruby/lib/rubygems/package/tar_writer.rb:<line_a>:in `add_file_signed'
     <build-dir>/ruby/lib/rubygems/package.rb:<line_a>:in `add_metadata'
     <build-dir>/ruby/lib/rubygems/package.rb:<line_a>:in `block (2 levels) in build'
@@ 18322 @@
 
  <n>) Error:
 TestRDocRubygemsHook#test_generate_default_gem:
-RuntimeError: no  in [#<Digest::SHA512: 7ddbb55b1c8a22322ee14ab4acea2dda63ffc3eb0e6890610906cfdb9bb4aadde403cb188a736e10fe392895222eb383609e69de3f5569a2166ae2436b315290>]
     <build-dir>/ruby/lib/rubygems/package/tar_writer.rb:<line_a>:in `add_file_signed'
     <build-dir>/ruby/lib/rubygems/package.rb:<line_a>:in `add_metadata'
     <build-dir>/ruby/lib/rubygems/package.rb:<line_a>:in `block (2 levels) in build'
@@ 24536 @@
 /* end */
 
 "gcc -o conftest -I../../.ext/include/x86_64-linux -I../.././include -I../.././ext/openssl -DRUBY_DEBUG_ENV    -O3 -fno-fast-math -ggdb3 -Wall -Wextra -Wno-unused-parameter -Wno-parentheses -Wno-long-long -Wno-missing-field-initializers -Wunused-variable -Wpointer-arith -Wwrite-strings -Wdeclaration-after-statement -Wimplicit-function-declaration -Wdeprecated-declarations -Wno-packed-bitfield-compat conftest.c  -L. -L../.. -L. -fstack-protector -rdynamic -Wl,-export-dynamic     -Wl,-rpath,<build-dir>/lib -L<build-dir>/lib -lruby-static -lnsl  -lpthread -ldl -lcrypt -lm   -lc"
-/usr/bin/ld: <build-dir>/tmp/ccbLQMsr.o: in function `t':
 <build-dir>/ruby/ext/openssl/conftest.c:14: undefined reference to `t_open'
 collect2: error: ld returned 1 exit status
 checked program was:
@@ 24660 @@
 /* end */
 
 "gcc -o conftest -I../../.ext/include/x86_64-linux -I../.././include -I../.././ext/openssl -DRUBY_DEBUG_ENV    -O3 -fno-fast-math -ggdb3 -Wall -Wextra -Wno-unused-parameter -Wno-parentheses -Wno-long-long -Wno-missing-field-initializers -Wunused-variable -Wpointer-arith -Wwrite-strings -Wdeclaration-after-statement -Wimplicit-function-declaration -Wdeprecated-declarations -Wno-packed-bitfield-compat conftest.c  -L. -L../.. -L. -fstack-protector -rdynamic -Wl,-export-dynamic     -Wl,-rpath,<build-dir>/lib -L<build-dir>/lib -lruby-static -lcrypto  -lpthread -ldl -lcrypt -lm   -lc"
-/usr/bin/ld: <build-dir>/tmp/cc8n2Cvj.o: in function `t':
 <build-dir>/ruby/ext/openssl/conftest.c:14: undefined reference to `OpenSSL_add_all_digests'
 collect2: error: ld returned 1 exit status
 checked program was:
@@ 27293 @@
 TestTempfile#test_close_with_unlink_now_true_works = <elapsed> s = .
 TestTempfile#test_concurrency = <elapsed> s = .
 TestTempfile#test_create_traversal_dir = <elapsed> s = .
-Leaked file descriptor: TestTempfile#test_create_traversal_dir: <fd> : #<File:<build-dir>/tmp/..............datachkbuildtmpbuild<buildtime>rubyfoo20181109-9301-uvcq0t>
 TestTempfile#test_create_with_block = <elapsed> s = .
 Closed file descriptor: <test-method>: <fd>
 TestTempfile#test_create_without_block = <elapsed> s = .
@@ 60596 @@
 - supports escaping characters when used as a terminator
 - treats an escaped non-escapable character normally when used as a terminator
 - does not support handling unicode 9.0 characters with POSIX bracket expressions
-- supports handling unicode 8.0 characters with POSIX bracket expressions
 
 <build-dir>/rubyspec/language/rescue_spec.rb
 The rescue keyword

OlderDiff < 20181109T013510Z(failure) < ThisDiff > 20181109T043750Z(failure) > NewerDiff


chkbuild summary recent last