r65135 ruby 2.3.8p459 (2018-10-18) [x86_64-linux] [2.3] (ubuntu) 1024W failed(test-all) 4failed(test/) rubyspec:4F7E failed(dist)

chkbuild summary recent last

OlderDiff < 20181113T043501Z(failure) < ThisDiff > 20181113T073731Z(failure) > NewerDiff

===================================================================
+++ 20181113T073731Z
@@ 152 @@
 Gid:	1003	1003	1003	1003
 FDSize:	64
 Groups:	1003
+NStgid:	6512
+NSpid:	6512
+NSpgid:	6512
+NSsid:	21764
 VmPeak: <nnn> kB
 VmSize: <nnn> kB
 VmLck: <nnn> kB
 VmPin:	       0 kB
 VmHWM: <nnn> kB
 VmRSS: <nnn> kB
+RssAnon:	      68 kB
+RssFile:	     760 kB
 RssShmem:	       0 kB
 VmData: <nnn> kB
 VmStk: <nnn> kB
@@ 17982 @@
 
  <n>) Error:
 TestRDocRubygemsHook#test_generate_force:
+RuntimeError: no  in [#<Digest::SHA512: 533857533fe15880188d7e2861a63f407c35fba51152429f23a418eb4f92a38aa973ae293acad1ec11c8e739e23a4096b0c1d1905a6b3de62f526da96e1700fb>]
     <build-dir>/ruby/lib/rubygems/package/tar_writer.rb:<line_a>:in `add_file_signed'
     <build-dir>/ruby/lib/rubygems/package.rb:<line_a>:in `add_metadata'
     <build-dir>/ruby/lib/rubygems/package.rb:<line_a>:in `block (2 levels) in build'
@@ 18002 @@
 
  <n>) Error:
 TestRDocRubygemsHook#test_remove_unwritable:
+RuntimeError: no  in [#<Digest::SHA512: 533857533fe15880188d7e2861a63f407c35fba51152429f23a418eb4f92a38aa973ae293acad1ec11c8e739e23a4096b0c1d1905a6b3de62f526da96e1700fb>]
     <build-dir>/ruby/lib/rubygems/package/tar_writer.rb:<line_a>:in `add_file_signed'
     <build-dir>/ruby/lib/rubygems/package.rb:<line_a>:in `add_metadata'
     <build-dir>/ruby/lib/rubygems/package.rb:<line_a>:in `block (2 levels) in build'
@@ 18022 @@
 
  <n>) Error:
 TestRDocRubygemsHook#test_setup_unwritable:
+RuntimeError: no  in [#<Digest::SHA512: 533857533fe15880188d7e2861a63f407c35fba51152429f23a418eb4f92a38aa973ae293acad1ec11c8e739e23a4096b0c1d1905a6b3de62f526da96e1700fb>]
     <build-dir>/ruby/lib/rubygems/package/tar_writer.rb:<line_a>:in `add_file_signed'
     <build-dir>/ruby/lib/rubygems/package.rb:<line_a>:in `add_metadata'
     <build-dir>/ruby/lib/rubygems/package.rb:<line_a>:in `block (2 levels) in build'
@@ 18042 @@
 
  <n>) Error:
 TestRDocRubygemsHook#test_ri_installed?:
+RuntimeError: no  in [#<Digest::SHA512: 533857533fe15880188d7e2861a63f407c35fba51152429f23a418eb4f92a38aa973ae293acad1ec11c8e739e23a4096b0c1d1905a6b3de62f526da96e1700fb>]
     <build-dir>/ruby/lib/rubygems/package/tar_writer.rb:<line_a>:in `add_file_signed'
     <build-dir>/ruby/lib/rubygems/package.rb:<line_a>:in `add_metadata'
     <build-dir>/ruby/lib/rubygems/package.rb:<line_a>:in `block (2 levels) in build'
@@ 18062 @@
 
  <n>) Error:
 TestRDocRubygemsHook#test_generate_no_overwrite:
+RuntimeError: no  in [#<Digest::SHA512: 533857533fe15880188d7e2861a63f407c35fba51152429f23a418eb4f92a38aa973ae293acad1ec11c8e739e23a4096b0c1d1905a6b3de62f526da96e1700fb>]
     <build-dir>/ruby/lib/rubygems/package/tar_writer.rb:<line_a>:in `add_file_signed'
     <build-dir>/ruby/lib/rubygems/package.rb:<line_a>:in `add_metadata'
     <build-dir>/ruby/lib/rubygems/package.rb:<line_a>:in `block (2 levels) in build'
@@ 18082 @@
 
  <n>) Error:
 TestRDocRubygemsHook#test_initialize:
+RuntimeError: no  in [#<Digest::SHA512: 533857533fe15880188d7e2861a63f407c35fba51152429f23a418eb4f92a38aa973ae293acad1ec11c8e739e23a4096b0c1d1905a6b3de62f526da96e1700fb>]
     <build-dir>/ruby/lib/rubygems/package/tar_writer.rb:<line_a>:in `add_file_signed'
     <build-dir>/ruby/lib/rubygems/package.rb:<line_a>:in `add_metadata'
     <build-dir>/ruby/lib/rubygems/package.rb:<line_a>:in `block (2 levels) in build'
@@ 18102 @@
 
  <n>) Error:
 TestRDocRubygemsHook#test_delete_legacy_args:
+RuntimeError: no  in [#<Digest::SHA512: 533857533fe15880188d7e2861a63f407c35fba51152429f23a418eb4f92a38aa973ae293acad1ec11c8e739e23a4096b0c1d1905a6b3de62f526da96e1700fb>]
     <build-dir>/ruby/lib/rubygems/package/tar_writer.rb:<line_a>:in `add_file_signed'
     <build-dir>/ruby/lib/rubygems/package.rb:<line_a>:in `add_metadata'
     <build-dir>/ruby/lib/rubygems/package.rb:<line_a>:in `block (2 levels) in build'
@@ 18122 @@
 
  <n>) Error:
 TestRDocRubygemsHook#test_generate_all:
+RuntimeError: no  in [#<Digest::SHA512: 533857533fe15880188d7e2861a63f407c35fba51152429f23a418eb4f92a38aa973ae293acad1ec11c8e739e23a4096b0c1d1905a6b3de62f526da96e1700fb>]
     <build-dir>/ruby/lib/rubygems/package/tar_writer.rb:<line_a>:in `add_file_signed'
     <build-dir>/ruby/lib/rubygems/package.rb:<line_a>:in `add_metadata'
     <build-dir>/ruby/lib/rubygems/package.rb:<line_a>:in `block (2 levels) in build'
@@ 18142 @@
 
  <n>) Error:
 TestRDocRubygemsHook#test_remove:
+RuntimeError: no  in [#<Digest::SHA512: 533857533fe15880188d7e2861a63f407c35fba51152429f23a418eb4f92a38aa973ae293acad1ec11c8e739e23a4096b0c1d1905a6b3de62f526da96e1700fb>]
     <build-dir>/ruby/lib/rubygems/package/tar_writer.rb:<line_a>:in `add_file_signed'
     <build-dir>/ruby/lib/rubygems/package.rb:<line_a>:in `add_metadata'
     <build-dir>/ruby/lib/rubygems/package.rb:<line_a>:in `block (2 levels) in build'
@@ 18162 @@
 
  <n>) Error:
 TestRDocRubygemsHook#test_generate_disabled:
+RuntimeError: no  in [#<Digest::SHA512: 533857533fe15880188d7e2861a63f407c35fba51152429f23a418eb4f92a38aa973ae293acad1ec11c8e739e23a4096b0c1d1905a6b3de62f526da96e1700fb>]
     <build-dir>/ruby/lib/rubygems/package/tar_writer.rb:<line_a>:in `add_file_signed'
     <build-dir>/ruby/lib/rubygems/package.rb:<line_a>:in `add_metadata'
     <build-dir>/ruby/lib/rubygems/package.rb:<line_a>:in `block (2 levels) in build'
@@ 18182 @@
 
  <n>) Error:
 TestRDocRubygemsHook#test_document:
+RuntimeError: no  in [#<Digest::SHA512: 533857533fe15880188d7e2861a63f407c35fba51152429f23a418eb4f92a38aa973ae293acad1ec11c8e739e23a4096b0c1d1905a6b3de62f526da96e1700fb>]
     <build-dir>/ruby/lib/rubygems/package/tar_writer.rb:<line_a>:in `add_file_signed'
     <build-dir>/ruby/lib/rubygems/package.rb:<line_a>:in `add_metadata'
     <build-dir>/ruby/lib/rubygems/package.rb:<line_a>:in `block (2 levels) in build'
@@ 18202 @@
 
  <n>) Error:
 TestRDocRubygemsHook#test_generate:
+RuntimeError: no  in [#<Digest::SHA512: 533857533fe15880188d7e2861a63f407c35fba51152429f23a418eb4f92a38aa973ae293acad1ec11c8e739e23a4096b0c1d1905a6b3de62f526da96e1700fb>]
     <build-dir>/ruby/lib/rubygems/package/tar_writer.rb:<line_a>:in `add_file_signed'
     <build-dir>/ruby/lib/rubygems/package.rb:<line_a>:in `add_metadata'
     <build-dir>/ruby/lib/rubygems/package.rb:<line_a>:in `block (2 levels) in build'
@@ 18222 @@
 
  <n>) Error:
 TestRDocRubygemsHook#test_setup:
+RuntimeError: no  in [#<Digest::SHA512: 533857533fe15880188d7e2861a63f407c35fba51152429f23a418eb4f92a38aa973ae293acad1ec11c8e739e23a4096b0c1d1905a6b3de62f526da96e1700fb>]
     <build-dir>/ruby/lib/rubygems/package/tar_writer.rb:<line_a>:in `add_file_signed'
     <build-dir>/ruby/lib/rubygems/package.rb:<line_a>:in `add_metadata'
     <build-dir>/ruby/lib/rubygems/package.rb:<line_a>:in `block (2 levels) in build'
@@ 18242 @@
 
  <n>) Error:
 TestRDocRubygemsHook#test_generate_configuration_rdoc_string:
+RuntimeError: no  in [#<Digest::SHA512: 533857533fe15880188d7e2861a63f407c35fba51152429f23a418eb4f92a38aa973ae293acad1ec11c8e739e23a4096b0c1d1905a6b3de62f526da96e1700fb>]
     <build-dir>/ruby/lib/rubygems/package/tar_writer.rb:<line_a>:in `add_file_signed'
     <build-dir>/ruby/lib/rubygems/package.rb:<line_a>:in `add_metadata'
     <build-dir>/ruby/lib/rubygems/package.rb:<line_a>:in `block (2 levels) in build'
@@ 18262 @@
 
  <n>) Error:
 TestRDocRubygemsHook#test_generate_default_gem:
+RuntimeError: no  in [#<Digest::SHA512: 533857533fe15880188d7e2861a63f407c35fba51152429f23a418eb4f92a38aa973ae293acad1ec11c8e739e23a4096b0c1d1905a6b3de62f526da96e1700fb>]
     <build-dir>/ruby/lib/rubygems/package/tar_writer.rb:<line_a>:in `add_file_signed'
     <build-dir>/ruby/lib/rubygems/package.rb:<line_a>:in `add_metadata'
     <build-dir>/ruby/lib/rubygems/package.rb:<line_a>:in `block (2 levels) in build'
@@ 18282 @@
 
  <n>) Error:
 TestRDocRubygemsHook#test_rdoc_installed?:
+RuntimeError: no  in [#<Digest::SHA512: 533857533fe15880188d7e2861a63f407c35fba51152429f23a418eb4f92a38aa973ae293acad1ec11c8e739e23a4096b0c1d1905a6b3de62f526da96e1700fb>]
     <build-dir>/ruby/lib/rubygems/package/tar_writer.rb:<line_a>:in `add_file_signed'
     <build-dir>/ruby/lib/rubygems/package.rb:<line_a>:in `add_metadata'
     <build-dir>/ruby/lib/rubygems/package.rb:<line_a>:in `block (2 levels) in build'
@@ 18302 @@
 
  <n>) Error:
 TestRDocRubygemsHook#test_new_rdoc:
+RuntimeError: no  in [#<Digest::SHA512: 533857533fe15880188d7e2861a63f407c35fba51152429f23a418eb4f92a38aa973ae293acad1ec11c8e739e23a4096b0c1d1905a6b3de62f526da96e1700fb>]
     <build-dir>/ruby/lib/rubygems/package/tar_writer.rb:<line_a>:in `add_file_signed'
     <build-dir>/ruby/lib/rubygems/package.rb:<line_a>:in `add_metadata'
     <build-dir>/ruby/lib/rubygems/package.rb:<line_a>:in `block (2 levels) in build'
@@ 18322 @@
 
  <n>) Error:
 TestRDocRubygemsHook#test_generate_configuration_rdoc_array:
+RuntimeError: no  in [#<Digest::SHA512: 533857533fe15880188d7e2861a63f407c35fba51152429f23a418eb4f92a38aa973ae293acad1ec11c8e739e23a4096b0c1d1905a6b3de62f526da96e1700fb>]
     <build-dir>/ruby/lib/rubygems/package/tar_writer.rb:<line_a>:in `add_file_signed'
     <build-dir>/ruby/lib/rubygems/package.rb:<line_a>:in `add_metadata'
     <build-dir>/ruby/lib/rubygems/package.rb:<line_a>:in `block (2 levels) in build'
@@ 24536 @@
 /* end */
 
 "gcc -o conftest -I../../.ext/include/x86_64-linux -I../.././include -I../.././ext/openssl -DRUBY_DEBUG_ENV    -O3 -fno-fast-math -ggdb3 -Wall -Wextra -Wno-unused-parameter -Wno-parentheses -Wno-long-long -Wno-missing-field-initializers -Wunused-variable -Wpointer-arith -Wwrite-strings -Wdeclaration-after-statement -Wimplicit-function-declaration -Wdeprecated-declarations -Wno-packed-bitfield-compat conftest.c  -L. -L../.. -L. -fstack-protector -rdynamic -Wl,-export-dynamic     -Wl,-rpath,<build-dir>/lib -L<build-dir>/lib -lruby-static -lnsl  -lpthread -ldl -lcrypt -lm   -lc"
+/usr/bin/ld: <build-dir>/tmp/ccv1CCFJ.o: in function `t':
 <build-dir>/ruby/ext/openssl/conftest.c:14: undefined reference to `t_open'
 collect2: error: ld returned 1 exit status
 checked program was:
@@ 24660 @@
 /* end */
 
 "gcc -o conftest -I../../.ext/include/x86_64-linux -I../.././include -I../.././ext/openssl -DRUBY_DEBUG_ENV    -O3 -fno-fast-math -ggdb3 -Wall -Wextra -Wno-unused-parameter -Wno-parentheses -Wno-long-long -Wno-missing-field-initializers -Wunused-variable -Wpointer-arith -Wwrite-strings -Wdeclaration-after-statement -Wimplicit-function-declaration -Wdeprecated-declarations -Wno-packed-bitfield-compat conftest.c  -L. -L../.. -L. -fstack-protector -rdynamic -Wl,-export-dynamic     -Wl,-rpath,<build-dir>/lib -L<build-dir>/lib -lruby-static -lcrypto  -lpthread -ldl -lcrypt -lm   -lc"
+/usr/bin/ld: <build-dir>/tmp/ccLiZazr.o: in function `t':
 <build-dir>/ruby/ext/openssl/conftest.c:14: undefined reference to `OpenSSL_add_all_digests'
 collect2: error: ld returned 1 exit status
 checked program was:
@@ 27293 @@
 TestTempfile#test_close_with_unlink_now_true_works = <elapsed> s = .
 TestTempfile#test_concurrency = <elapsed> s = .
 TestTempfile#test_create_traversal_dir = <elapsed> s = .
+Leaked file descriptor: TestTempfile#test_create_traversal_dir: <fd> : #<File:<build-dir>/tmp/..............datachkbuildtmpbuild<buildtime>rubyfoo20181113-11617-1wtt5tg>
 TestTempfile#test_create_with_block = <elapsed> s = .
 Closed file descriptor: <test-method>: <fd>
 TestTempfile#test_create_without_block = <elapsed> s = .
@@ 78139 @@
 *** using http instead of https ***
 downloading did_you_mean-1.0.0.gem ... done
 downloading for ext/fiddle/extlibs
+downloading libffi-3.2.1.tar.gz ... #<RuntimeError: failed to download libffi-3.2.1.tar.gz
+530 Sorry, max 30 users -- try again later
+: ftp://sourceware.org/pub/libffi/libffi-3.2.1.tar.gz>
+make[1]: *** [Makefile:1585: extract-extlibs] Error 1
 make[1]: Leaving directory '<build-dir>/tmp/ruby-snapshot<tmp>/ruby-<verrev>'
+prerequisites failed
+make: *** [uncommon.mk:954: dist] Error 1
 exit 2
+failed(dist)
 == end # <time>
 <elapsed time>

===================================================================
--- 20181113T043501Z
@@ 152 @@
 Gid:	1003	1003	1003	1003
 FDSize:	64
 Groups:	1003
-NStgid:	8286
-NSpid:	8286
-NSpgid:	8286
-NSsid:	2130
 VmPeak: <nnn> kB
 VmSize: <nnn> kB
 VmLck: <nnn> kB
 VmPin:	       0 kB
 VmHWM: <nnn> kB
 VmRSS: <nnn> kB
-RssAnon:	      64 kB
-RssFile:	     624 kB
 RssShmem:	       0 kB
 VmData: <nnn> kB
 VmStk: <nnn> kB
@@ 17982 @@
 
  <n>) Error:
 TestRDocRubygemsHook#test_generate_force:
-RuntimeError: no  in [#<Digest::SHA512: 2dca844c8cde4a8d12c826dec1e71e810c658c7640fea5ad3653ed181dba6a66f6d87c2dec1fa93f12fa342228250a788e8bd70df3f76d6cbfb862e1c450c4d1>]
     <build-dir>/ruby/lib/rubygems/package/tar_writer.rb:<line_a>:in `add_file_signed'
     <build-dir>/ruby/lib/rubygems/package.rb:<line_a>:in `add_metadata'
     <build-dir>/ruby/lib/rubygems/package.rb:<line_a>:in `block (2 levels) in build'
@@ 18002 @@
 
  <n>) Error:
 TestRDocRubygemsHook#test_setup_unwritable:
-RuntimeError: no  in [#<Digest::SHA512: 2dca844c8cde4a8d12c826dec1e71e810c658c7640fea5ad3653ed181dba6a66f6d87c2dec1fa93f12fa342228250a788e8bd70df3f76d6cbfb862e1c450c4d1>]
     <build-dir>/ruby/lib/rubygems/package/tar_writer.rb:<line_a>:in `add_file_signed'
     <build-dir>/ruby/lib/rubygems/package.rb:<line_a>:in `add_metadata'
     <build-dir>/ruby/lib/rubygems/package.rb:<line_a>:in `block (2 levels) in build'
@@ 18022 @@
 
  <n>) Error:
 TestRDocRubygemsHook#test_generate_configuration_rdoc_array:
-RuntimeError: no  in [#<Digest::SHA512: 2dca844c8cde4a8d12c826dec1e71e810c658c7640fea5ad3653ed181dba6a66f6d87c2dec1fa93f12fa342228250a788e8bd70df3f76d6cbfb862e1c450c4d1>]
     <build-dir>/ruby/lib/rubygems/package/tar_writer.rb:<line_a>:in `add_file_signed'
     <build-dir>/ruby/lib/rubygems/package.rb:<line_a>:in `add_metadata'
     <build-dir>/ruby/lib/rubygems/package.rb:<line_a>:in `block (2 levels) in build'
@@ 18042 @@
 
  <n>) Error:
 TestRDocRubygemsHook#test_new_rdoc:
-RuntimeError: no  in [#<Digest::SHA512: 2dca844c8cde4a8d12c826dec1e71e810c658c7640fea5ad3653ed181dba6a66f6d87c2dec1fa93f12fa342228250a788e8bd70df3f76d6cbfb862e1c450c4d1>]
     <build-dir>/ruby/lib/rubygems/package/tar_writer.rb:<line_a>:in `add_file_signed'
     <build-dir>/ruby/lib/rubygems/package.rb:<line_a>:in `add_metadata'
     <build-dir>/ruby/lib/rubygems/package.rb:<line_a>:in `block (2 levels) in build'
@@ 18062 @@
 
  <n>) Error:
 TestRDocRubygemsHook#test_setup:
-RuntimeError: no  in [#<Digest::SHA512: 2dca844c8cde4a8d12c826dec1e71e810c658c7640fea5ad3653ed181dba6a66f6d87c2dec1fa93f12fa342228250a788e8bd70df3f76d6cbfb862e1c450c4d1>]
     <build-dir>/ruby/lib/rubygems/package/tar_writer.rb:<line_a>:in `add_file_signed'
     <build-dir>/ruby/lib/rubygems/package.rb:<line_a>:in `add_metadata'
     <build-dir>/ruby/lib/rubygems/package.rb:<line_a>:in `block (2 levels) in build'
@@ 18082 @@
 
  <n>) Error:
 TestRDocRubygemsHook#test_generate_disabled:
-RuntimeError: no  in [#<Digest::SHA512: 2dca844c8cde4a8d12c826dec1e71e810c658c7640fea5ad3653ed181dba6a66f6d87c2dec1fa93f12fa342228250a788e8bd70df3f76d6cbfb862e1c450c4d1>]
     <build-dir>/ruby/lib/rubygems/package/tar_writer.rb:<line_a>:in `add_file_signed'
     <build-dir>/ruby/lib/rubygems/package.rb:<line_a>:in `add_metadata'
     <build-dir>/ruby/lib/rubygems/package.rb:<line_a>:in `block (2 levels) in build'
@@ 18102 @@
 
  <n>) Error:
 TestRDocRubygemsHook#test_generate_all:
-RuntimeError: no  in [#<Digest::SHA512: 2dca844c8cde4a8d12c826dec1e71e810c658c7640fea5ad3653ed181dba6a66f6d87c2dec1fa93f12fa342228250a788e8bd70df3f76d6cbfb862e1c450c4d1>]
     <build-dir>/ruby/lib/rubygems/package/tar_writer.rb:<line_a>:in `add_file_signed'
     <build-dir>/ruby/lib/rubygems/package.rb:<line_a>:in `add_metadata'
     <build-dir>/ruby/lib/rubygems/package.rb:<line_a>:in `block (2 levels) in build'
@@ 18122 @@
 
  <n>) Error:
 TestRDocRubygemsHook#test_generate_configuration_rdoc_string:
-RuntimeError: no  in [#<Digest::SHA512: 2dca844c8cde4a8d12c826dec1e71e810c658c7640fea5ad3653ed181dba6a66f6d87c2dec1fa93f12fa342228250a788e8bd70df3f76d6cbfb862e1c450c4d1>]
     <build-dir>/ruby/lib/rubygems/package/tar_writer.rb:<line_a>:in `add_file_signed'
     <build-dir>/ruby/lib/rubygems/package.rb:<line_a>:in `add_metadata'
     <build-dir>/ruby/lib/rubygems/package.rb:<line_a>:in `block (2 levels) in build'
@@ 18142 @@
 
  <n>) Error:
 TestRDocRubygemsHook#test_generate_no_overwrite:
-RuntimeError: no  in [#<Digest::SHA512: b16d3a7eb4bcf3c3565ea0bcd8210a1feb47a7d3547192e9adc6c91b8c3a751a04c10c4c44dac603a04f70b9edcd1c30c8fc19bf6d6f8d99534d0a4b6bd67e81>]
     <build-dir>/ruby/lib/rubygems/package/tar_writer.rb:<line_a>:in `add_file_signed'
     <build-dir>/ruby/lib/rubygems/package.rb:<line_a>:in `add_metadata'
     <build-dir>/ruby/lib/rubygems/package.rb:<line_a>:in `block (2 levels) in build'
@@ 18162 @@
 
  <n>) Error:
 TestRDocRubygemsHook#test_delete_legacy_args:
-RuntimeError: no  in [#<Digest::SHA512: b16d3a7eb4bcf3c3565ea0bcd8210a1feb47a7d3547192e9adc6c91b8c3a751a04c10c4c44dac603a04f70b9edcd1c30c8fc19bf6d6f8d99534d0a4b6bd67e81>]
     <build-dir>/ruby/lib/rubygems/package/tar_writer.rb:<line_a>:in `add_file_signed'
     <build-dir>/ruby/lib/rubygems/package.rb:<line_a>:in `add_metadata'
     <build-dir>/ruby/lib/rubygems/package.rb:<line_a>:in `block (2 levels) in build'
@@ 18182 @@
 
  <n>) Error:
 TestRDocRubygemsHook#test_generate:
-RuntimeError: no  in [#<Digest::SHA512: b16d3a7eb4bcf3c3565ea0bcd8210a1feb47a7d3547192e9adc6c91b8c3a751a04c10c4c44dac603a04f70b9edcd1c30c8fc19bf6d6f8d99534d0a4b6bd67e81>]
     <build-dir>/ruby/lib/rubygems/package/tar_writer.rb:<line_a>:in `add_file_signed'
     <build-dir>/ruby/lib/rubygems/package.rb:<line_a>:in `add_metadata'
     <build-dir>/ruby/lib/rubygems/package.rb:<line_a>:in `block (2 levels) in build'
@@ 18202 @@
 
  <n>) Error:
 TestRDocRubygemsHook#test_generate_default_gem:
-RuntimeError: no  in [#<Digest::SHA512: b16d3a7eb4bcf3c3565ea0bcd8210a1feb47a7d3547192e9adc6c91b8c3a751a04c10c4c44dac603a04f70b9edcd1c30c8fc19bf6d6f8d99534d0a4b6bd67e81>]
     <build-dir>/ruby/lib/rubygems/package/tar_writer.rb:<line_a>:in `add_file_signed'
     <build-dir>/ruby/lib/rubygems/package.rb:<line_a>:in `add_metadata'
     <build-dir>/ruby/lib/rubygems/package.rb:<line_a>:in `block (2 levels) in build'
@@ 18222 @@
 
  <n>) Error:
 TestRDocRubygemsHook#test_remove_unwritable:
-RuntimeError: no  in [#<Digest::SHA512: b16d3a7eb4bcf3c3565ea0bcd8210a1feb47a7d3547192e9adc6c91b8c3a751a04c10c4c44dac603a04f70b9edcd1c30c8fc19bf6d6f8d99534d0a4b6bd67e81>]
     <build-dir>/ruby/lib/rubygems/package/tar_writer.rb:<line_a>:in `add_file_signed'
     <build-dir>/ruby/lib/rubygems/package.rb:<line_a>:in `add_metadata'
     <build-dir>/ruby/lib/rubygems/package.rb:<line_a>:in `block (2 levels) in build'
@@ 18242 @@
 
  <n>) Error:
 TestRDocRubygemsHook#test_rdoc_installed?:
-RuntimeError: no  in [#<Digest::SHA512: b16d3a7eb4bcf3c3565ea0bcd8210a1feb47a7d3547192e9adc6c91b8c3a751a04c10c4c44dac603a04f70b9edcd1c30c8fc19bf6d6f8d99534d0a4b6bd67e81>]
     <build-dir>/ruby/lib/rubygems/package/tar_writer.rb:<line_a>:in `add_file_signed'
     <build-dir>/ruby/lib/rubygems/package.rb:<line_a>:in `add_metadata'
     <build-dir>/ruby/lib/rubygems/package.rb:<line_a>:in `block (2 levels) in build'
@@ 18262 @@
 
  <n>) Error:
 TestRDocRubygemsHook#test_initialize:
-RuntimeError: no  in [#<Digest::SHA512: b16d3a7eb4bcf3c3565ea0bcd8210a1feb47a7d3547192e9adc6c91b8c3a751a04c10c4c44dac603a04f70b9edcd1c30c8fc19bf6d6f8d99534d0a4b6bd67e81>]
     <build-dir>/ruby/lib/rubygems/package/tar_writer.rb:<line_a>:in `add_file_signed'
     <build-dir>/ruby/lib/rubygems/package.rb:<line_a>:in `add_metadata'
     <build-dir>/ruby/lib/rubygems/package.rb:<line_a>:in `block (2 levels) in build'
@@ 18282 @@
 
  <n>) Error:
 TestRDocRubygemsHook#test_ri_installed?:
-RuntimeError: no  in [#<Digest::SHA512: b16d3a7eb4bcf3c3565ea0bcd8210a1feb47a7d3547192e9adc6c91b8c3a751a04c10c4c44dac603a04f70b9edcd1c30c8fc19bf6d6f8d99534d0a4b6bd67e81>]
     <build-dir>/ruby/lib/rubygems/package/tar_writer.rb:<line_a>:in `add_file_signed'
     <build-dir>/ruby/lib/rubygems/package.rb:<line_a>:in `add_metadata'
     <build-dir>/ruby/lib/rubygems/package.rb:<line_a>:in `block (2 levels) in build'
@@ 18302 @@
 
  <n>) Error:
 TestRDocRubygemsHook#test_document:
-RuntimeError: no  in [#<Digest::SHA512: b16d3a7eb4bcf3c3565ea0bcd8210a1feb47a7d3547192e9adc6c91b8c3a751a04c10c4c44dac603a04f70b9edcd1c30c8fc19bf6d6f8d99534d0a4b6bd67e81>]
     <build-dir>/ruby/lib/rubygems/package/tar_writer.rb:<line_a>:in `add_file_signed'
     <build-dir>/ruby/lib/rubygems/package.rb:<line_a>:in `add_metadata'
     <build-dir>/ruby/lib/rubygems/package.rb:<line_a>:in `block (2 levels) in build'
@@ 18322 @@
 
  <n>) Error:
 TestRDocRubygemsHook#test_remove:
-RuntimeError: no  in [#<Digest::SHA512: b16d3a7eb4bcf3c3565ea0bcd8210a1feb47a7d3547192e9adc6c91b8c3a751a04c10c4c44dac603a04f70b9edcd1c30c8fc19bf6d6f8d99534d0a4b6bd67e81>]
     <build-dir>/ruby/lib/rubygems/package/tar_writer.rb:<line_a>:in `add_file_signed'
     <build-dir>/ruby/lib/rubygems/package.rb:<line_a>:in `add_metadata'
     <build-dir>/ruby/lib/rubygems/package.rb:<line_a>:in `block (2 levels) in build'
@@ 24536 @@
 /* end */
 
 "gcc -o conftest -I../../.ext/include/x86_64-linux -I../.././include -I../.././ext/openssl -DRUBY_DEBUG_ENV    -O3 -fno-fast-math -ggdb3 -Wall -Wextra -Wno-unused-parameter -Wno-parentheses -Wno-long-long -Wno-missing-field-initializers -Wunused-variable -Wpointer-arith -Wwrite-strings -Wdeclaration-after-statement -Wimplicit-function-declaration -Wdeprecated-declarations -Wno-packed-bitfield-compat conftest.c  -L. -L../.. -L. -fstack-protector -rdynamic -Wl,-export-dynamic     -Wl,-rpath,<build-dir>/lib -L<build-dir>/lib -lruby-static -lnsl  -lpthread -ldl -lcrypt -lm   -lc"
-/usr/bin/ld: <build-dir>/tmp/ccYcgZ3X.o: in function `t':
 <build-dir>/ruby/ext/openssl/conftest.c:14: undefined reference to `t_open'
 collect2: error: ld returned 1 exit status
 checked program was:
@@ 24660 @@
 /* end */
 
 "gcc -o conftest -I../../.ext/include/x86_64-linux -I../.././include -I../.././ext/openssl -DRUBY_DEBUG_ENV    -O3 -fno-fast-math -ggdb3 -Wall -Wextra -Wno-unused-parameter -Wno-parentheses -Wno-long-long -Wno-missing-field-initializers -Wunused-variable -Wpointer-arith -Wwrite-strings -Wdeclaration-after-statement -Wimplicit-function-declaration -Wdeprecated-declarations -Wno-packed-bitfield-compat conftest.c  -L. -L../.. -L. -fstack-protector -rdynamic -Wl,-export-dynamic     -Wl,-rpath,<build-dir>/lib -L<build-dir>/lib -lruby-static -lcrypto  -lpthread -ldl -lcrypt -lm   -lc"
-/usr/bin/ld: <build-dir>/tmp/ccCo3Jnw.o: in function `t':
 <build-dir>/ruby/ext/openssl/conftest.c:14: undefined reference to `OpenSSL_add_all_digests'
 collect2: error: ld returned 1 exit status
 checked program was:
@@ 27293 @@
 TestTempfile#test_close_with_unlink_now_true_works = <elapsed> s = .
 TestTempfile#test_concurrency = <elapsed> s = .
 TestTempfile#test_create_traversal_dir = <elapsed> s = .
-Leaked file descriptor: TestTempfile#test_create_traversal_dir: <fd> : #<File:<build-dir>/tmp/..............datachkbuildtmpbuild<buildtime>rubyfoo20181113-14249-1nm4r0l>
 TestTempfile#test_create_with_block = <elapsed> s = .
 Closed file descriptor: <test-method>: <fd>
 TestTempfile#test_create_without_block = <elapsed> s = .
@@ 78139 @@
 *** using http instead of https ***
 downloading did_you_mean-1.0.0.gem ... done
 downloading for ext/fiddle/extlibs
-downloading libffi-3.2.1.tar.gz ... done
-checking md5 of .downloaded-cache/libffi-3.2.1.tar.gz ... OK
-extracting .downloaded-cache/libffi-3.2.1.tar.gz into ext/fiddle
-applying win32/libffi-3.2.1-mswin.patch under ext/fiddle
-patching file libffi-3.2.1/src/x86/ffi.c
-patching file libffi-3.2.1/src/x86/ffitarget.h
-patching file libffi-3.2.1/src/x86/win64.S
-patching file libffi-3.2.1/include/ffi.h.in
-Extracting bundled gem files...
-Unpacked power_assert-0.2.6.gem
-Unpacked test-unit-3.1.5.gem
-Unpacked minitest-5.8.5.gem
-Unpacked rake-10.4.2.gem
-Unpacked net-telnet-0.1.1.gem
-Unpacked did_you_mean-1.0.0.gem
 make[1]: Leaving directory '<build-dir>/tmp/ruby-snapshot<tmp>/ruby-<verrev>'
-prerequisites done
-creating tarball... ruby-<verrev>.tar done
-creating bzip tarball... <build-dir>/ruby/tmp/ruby-<verrev>.tar.bz2 done
-creating gzip tarball... <build-dir>/ruby/tmp/ruby-<verrev>.tar.gz done
-creating xz tarball... <build-dir>/ruby/tmp/ruby-<verrev>.tar.xz done
-creating zip archive... <build-dir>/ruby/tmp/ruby-<verrev>.zip done
-* <build-dir>/ruby/tmp/ruby-<verrev>.tar.bz2
-  SIZE:   <size> bytes
-  SHA1:   <digest>
-  SHA256: <digest>
-  SHA512: <digest>
-* <build-dir>/ruby/tmp/ruby-<verrev>.tar.gz
-  SIZE:   <size> bytes
-  SHA1:   <digest>
-  SHA256: <digest>
-  SHA512: <digest>
-* <build-dir>/ruby/tmp/ruby-<verrev>.tar.xz
-  SIZE:   <size> bytes
-  SHA1:   <digest>
-  SHA256: <digest>
-  SHA512: <digest>
-* <build-dir>/ruby/tmp/ruby-<verrev>.zip
-  SIZE:   <size> bytes
-  SHA1:   <digest>
-  SHA256: <digest>
-  SHA512: <digest>
 == end # <time>
 <elapsed time>

OlderDiff < 20181113T043501Z(failure) < ThisDiff > 20181113T073731Z(failure) > NewerDiff


chkbuild summary recent last